program: Gaussian 09
title: 000262696
version: EM64L-G09RevD.01
frameworkgroup: C1[X(C13H14N2O3)]
method: RPBEPBE
basis: SDD
operation: Freq
keyword: #p
keyword: freq=noraman
keyword: PBEPBE/SDD
title: #p freq=noraman PBEPBE/SDD
converged: YES YES NO NO
title: Mulliken charges:
elementType: O O O N N C C C C C C C C C C C C C H H H H H H H H H H H H H H
charge: -0.243304 -0.173323 -0.138168 -0.098464 -0.237381 -0.388037 -0.326256 -0.344519 -0.324429 -0.312545 0.319570 0.170256 0.053659 -0.051614 -0.303464 -0.333115 -0.196111 -0.249035 0.232991 0.249607 0.210033 0.225839 0.208130 0.206976 0.195138 0.222919 0.219209 0.190041 0.272406 0.270893 0.232853 0.239246
chargesum: 0.00000
title: Mulliken charges with hydrogens summed into heavy atoms:
elementType: O O O N N C C C C C C C C C C C C C
charge: -0.243304 -0.173323 -0.138168 -0.098464 -0.237381 0.094561 0.109616 0.070586 0.093628 0.096705 0.319570 0.170256 0.053659 -0.051614 -0.031058 -0.062222 0.036743 -0.009788
polarizability: 1.84655015e+02 -2.40877771e+00 1.91460235e+02 -2.35438262e+01 -3.79319600e+00 1.07108404e+02
1716.lowfreq: -9.4583 -5.0852 0.0003 0.0004 0.0007 3.9913 29.6709 33.3016 40.5215
frequency: 29.4222 33.1317 40.4590 100.5375 124.7576 135.9787 169.2286 222.5927 245.8111 254.5781 291.4258 306.3206 324.7672 339.1670 392.7325 395.0415 449.8419 467.1231 467.7907 473.3416 540.1689 546.4636 594.6126 615.5064 684.3802 699.5862 718.4858 760.1986 766.4356 804.6694 810.8263 839.3035 847.1387 878.6106 895.5171 927.5374 960.5595 990.8197 993.6278 1015.3526 1021.4005 1024.3048 1051.1042 1056.8082 1083.7992 1091.1402 1108.5041 1125.2394 1147.3944 1169.5214 1188.3033 1191.7280 1198.6015 1248.0277 1272.2055 1288.7980 1293.7779 1315.6800 1325.7629 1334.9665 1348.7307 1366.9631 1372.3982 1396.1692 1408.2869 1444.2393 1449.2529 1452.3841 1458.9050 1462.5630 1464.9597 1475.1261 1597.9612 1619.3442 1651.3061 1662.7129 2883.2445 2897.0010 2916.5664 2951.9823 2959.6914 3009.9725 3018.6687 3045.8645 3084.8241 3091.4256 3137.9870 3151.0717 3169.7435 3182.3397
redmass: 3.5907 4.5198 6.0934 10.1518 4.2115 4.5647 5.6756 2.9978 3.7367 2.5646 5.4989 6.3942 3.3764 3.0041 2.0550 3.3934 5.8191 3.4476 4.9917 5.6193 7.5053 3.9965 2.0790 5.6699 6.2337 5.7723 4.0450 1.7314 2.8111 3.8932 4.1042 1.9525 2.9979 1.4692 2.6727 4.7624 1.4086 1.3549 2.8048 2.1808 3.8353 2.3129 2.1917 2.1999 3.8345 2.0855 2.2425 2.7031 2.5602 1.3286 2.0011 1.0693 2.3270 1.3993 1.2956 1.4811 1.2932 2.5904 1.6597 1.2993 1.3343 1.4287 1.2675 2.5755 1.8525 1.0822 1.0866 1.0996 1.3315 2.2080 2.1633 1.1614 7.5102 8.2163 11.7335 11.6008 1.0688 1.0693 1.0655 1.0670 1.0670 1.0949 1.0911 1.0907 1.0960 1.0972 1.0868 1.0910 1.0973 1.0970
irintensity: 1.0283 1.8545 0.7565 0.5218 4.6608 1.3998 0.4059 4.2415 2.3554 1.6006 9.3903 3.8546 3.1827 2.7876 0.1223 0.4578 5.5383 7.5267 19.3091 5.0833 2.8365 6.2374 3.8468 4.7506 3.6752 3.8488 3.4370 61.7102 26.3955 20.7933 5.7672 2.8437 8.0217 0.9333 20.2110 9.1077 2.7068 0.4060 47.6501 4.5346 38.5848 2.3054 14.6256 14.5889 65.9819 20.5359 4.0974 79.1607 24.9565 5.2212 29.9006 1.5161 2.6049 29.3885 2.1369 40.7349 2.7639 83.6079 47.2550 2.6761 5.8506 4.1415 2.0260 47.6061 3.7162 2.7070 1.2926 19.7730 21.9606 87.1185 19.4299 52.7929 68.0664 409.2195 180.5962 45.0479 66.5122 63.6858 53.9362 40.7143 77.2500 10.9544 51.7734 29.6101 39.6687 29.6063 3.5993 5.0075 19.7151 5.9809
temp: 298.150 k
press: 1.00000 atm
elementType: 8 8 8 7 7 6 6 6 6 6 6 6 6 6 6 6 6 6 1 1 1 1 1 1 1 1 1 1 1 1 1 1
symmnumber: 1
zpe: 662866.4 jmol-1
zpe.correction: 0.252472 hartree
zpe.thermalcorrener: 0.267665 hartree
zpe.thermalcorrenthalpy: 0.268609 hartree
zpe.thermalcorrgfe: 0.208681 hartree
zpe.sumelectzpe: -837.618282 hartree
zpe.sumelectthermal: -837.603089 hartree
zpe.sumelectthermalent: -837.602145 hartree
zpe.sumelectthermalfe: -837.662073 hartree
dipole: 1.5957 5.8252 -1.9199
dipole: 6.3376
quadrupole: -117.0583 -112.6772 -100.7825
quadrupole: -13.9925 -6.4491 -0.5924
quadrupole: -6.8857 -2.5045 9.3902 -13.9925 -6.4491 -0.5924
hfenergy: -837.8707541 hartree
pointgroup: C01 [X(C13H14N2O3)]
dipole: -0.6326007 2.2493813 0.8701601 debye
polarizability: 184.7865814|3.5844222|190.8558549|-23.16754|8.0866745|107.5812181 unknown
InChI: InChI=1S/C13H14N2O3/c16-12-10-3-1-2-4-11(10)15(13(12)17)9-14-5-7-18-8-6-14/h1-4H,5-9H2
charge 0 multiplicity 1
32 atoms
O  -4.46976 0.288979 -0.975372
O  0.764649 -3.024926 0.252542
O  3.438092 -1.981242 -0.802669
N  -1.95137 -0.09326 0.397709
N  0.399323 -0.700307 0.595374
C  -0.926831 -0.774458 1.212978
C  -2.234972 -0.790444 -0.886098
C  -3.205176 0.159154 1.155834
C  -3.220416 0.044731 -1.717503
C  -4.170088 0.983076 0.28585
C  1.140879 0.49657 0.374614
C  2.418866 0.190644 -0.181547
C  1.137875 -1.831293 0.186558
C  2.509877 -1.272207 -0.347635
C  0.758993 1.823143 0.634404
C  3.342505 1.212009 -0.477719
C  1.700247 2.843108 0.33786
C  2.976348 2.551466 -0.209939
H  -0.900655 -0.281735 2.204544
H  -1.128145 -1.861061 1.361666
H  -2.663761 -1.806165 -0.7066
H  -1.290882 -0.913468 -1.447364
H  -2.965616 0.722155 2.079045
H  -3.708552 -0.793799 1.452112
H  -2.750992 1.014594 -1.989467
H  -3.520967 -0.492163 -2.631634
H  -5.14177 1.116694 0.788941
H  -3.719202 1.976432 0.070958
H  -0.235295 2.060704 1.019441
H  4.318933 0.95833 -0.9034
H  1.427237 3.886743 0.531316
H  3.672826 3.367099 -0.427497
