program: Gaussian 09
title: 000262767
version: EM64L-G09RevD.01
frameworkgroup: C1[X(C22H20O2S)]
method: RPBEPBE
basis: SDD
operation: Freq
keyword: #p
keyword: freq=noraman
keyword: PBEPBE/SDD
title: #p freq=noraman PBEPBE/SDD
converged: YES YES NO NO
title: Mulliken charges:
elementType: S O O C C C C C C C C C C C C C C C C C C C C C C H H H H H H H H H H H H H H H H H H H H
charge: 0.165245 -0.414004 -0.239534 -0.583928 0.490039 0.484995 0.405586 -0.669365 -0.357791 -0.352186 -0.394366 -0.391883 -0.404421 -0.359102 -0.436928 -0.249458 -0.239224 -0.261253 -0.244182 -0.253491 -0.257949 -0.245394 -0.244830 -0.248198 0.191825 0.272238 0.298296 0.248135 0.246909 0.270154 0.253091 0.260400 0.274914 0.293581 0.260457 0.227556 0.225104 0.230245 0.226523 0.226749 0.230795 0.228886 0.229005 0.231744 0.375013
chargesum: 0.00000
title: Mulliken charges with hydrogens summed into heavy atoms:
elementType: S O O C C C C C C C C C C C C C C C C C C C C C C
charge: 0.165245 -0.038991 -0.239534 -0.583928 0.490039 0.484995 0.405586 -0.098831 -0.109657 -0.105276 -0.124211 -0.138791 -0.144022 -0.084188 0.117110 -0.021901 -0.014120 -0.031007 -0.017658 -0.026742 -0.027154 -0.016508 -0.015825 -0.016453 0.191825
polarizability: 2.72008359e+02 4.32375798e+00 2.61370713e+02 1.74158823e+01 -7.86579911e+00 2.23445674e+02
1716.lowfreq: -7.8765 -5.5141 -0.0014 0.0005 0.0009 6.1341 19.9338 23.7447 29.7939
frequency: 19.8087 23.7348 29.7550 38.8979 49.9964 60.3541 66.7256 80.6179 90.9604 101.7684 119.4089 139.1888 175.3204 202.9321 221.6850 247.9068 260.6167 279.9287 281.6156 304.2716 325.0175 344.4577 400.0545 406.1653 411.9322 424.9579 480.5662 495.6266 502.3335 524.8486 566.4970 613.0732 614.6341 616.3009 618.6775 626.8928 637.5242 664.2687 699.5094 703.2967 705.7221 711.7142 737.4095 743.9699 756.7517 775.5032 819.7025 851.8949 859.3441 860.9928 862.6522 881.1599 887.0481 932.6623 936.0538 942.4842 979.4864 980.4147 985.6500 985.9510 990.2433 990.5066 991.0542 996.8330 997.7213 999.5356 1027.9589 1029.7352 1031.2541 1031.7626 1082.3376 1086.5586 1088.4122 1090.8771 1143.7645 1150.1851 1171.8094 1173.2427 1173.5870 1183.0736 1193.8021 1194.3799 1197.7359 1213.3597 1224.7683 1264.4725 1273.3582 1308.8042 1318.6017 1325.1906 1352.6036 1370.8382 1376.4031 1378.6845 1427.9594 1432.5279 1435.1421 1437.8329 1444.9309 1475.8131 1478.8102 1480.3330 1581.6397 1586.7393 1588.7040 1605.7166 1606.3941 1609.8816 1662.1938 3011.5914 3042.1507 3062.6350 3116.0222 3122.7706 3123.5971 3125.8276 3130.0415 3131.0267 3134.2992 3142.6966 3143.4988 3147.7689 3150.0747 3151.5347 3155.1133 3164.2845 3164.9281 3166.8547 3509.3792
redmass: 6.6591 9.0107 6.8378 4.5335 4.5491 4.4640 4.3447 4.0197 2.4928 4.0495 4.7953 5.4136 3.9660 5.1034 5.3101 4.5669 4.6914 5.6885 5.0037 5.9623 6.6132 6.8623 2.8227 2.8878 2.9096 4.7448 3.5204 4.0416 1.7749 3.5695 5.1777 5.9075 6.0563 6.1201 6.0246 5.9185 1.3242 6.0245 4.2711 1.9864 1.9263 1.7127 1.6254 1.8340 1.7830 2.0277 3.6019 1.2538 1.2544 1.2620 4.1839 4.4661 3.4087 1.5030 1.5154 1.5879 1.4990 1.6552 1.4441 1.4617 5.0211 5.0608 5.5354 1.3198 1.3268 1.3014 2.4639 3.1325 2.1605 2.2770 1.6695 2.3693 1.6067 1.6128 3.0527 1.1974 1.0710 1.0563 1.0511 3.0779 1.1632 1.1212 1.1353 4.0059 1.2693 1.4123 1.2011 1.4196 1.3627 1.3248 1.9374 5.5781 7.0279 8.4281 2.2104 2.0463 1.2878 1.8343 1.1021 2.1468 2.1524 2.1706 5.7911 6.0793 6.1697 5.9508 6.0519 6.0539 8.1937 1.0614 1.0599 1.0985 1.1043 1.0845 1.0845 1.0848 1.0874 1.0878 1.0880 1.0921 1.0923 1.0924 1.0951 1.0955 1.0954 1.1013 1.1014 1.1011 1.0639
irintensity: 0.4449 0.6214 0.2025 0.1628 0.1725 0.1450 0.0921 0.1492 0.9616 0.1994 0.8486 1.5151 1.6927 0.9562 0.4298 1.1636 1.4000 0.3603 0.1329 1.1210 0.3274 2.5140 0.0353 0.2848 0.1863 25.3617 3.1962 5.9139 26.6429 3.5200 36.8117 12.5414 3.6859 6.2407 7.0617 11.0472 114.5522 19.8080 3.6340 38.0622 71.8750 44.2803 93.3216 19.8021 43.1810 21.7200 2.1899 0.5545 0.8319 0.6333 0.3175 3.5663 1.2546 0.2608 0.3039 0.1962 0.3353 2.2169 0.5291 0.5281 1.1278 0.2174 1.1318 0.5853 0.1038 0.0427 1.3035 177.3263 33.3310 32.3749 13.1694 69.1963 3.6569 10.8008 1.1607 2.5386 0.3166 0.0531 0.0271 0.9036 1.2394 9.9833 0.8624 13.5911 5.5748 8.6285 1.9432 0.9269 4.9458 0.3409 87.8627 0.4500 0.9439 0.5831 5.4112 16.7679 20.2146 0.7585 27.1105 24.3235 8.6592 35.7163 0.7212 1.9320 0.2185 7.1589 7.7238 3.0303 182.3165 17.3975 9.3970 0.8128 5.0700 1.8683 1.7028 0.8031 2.8592 4.7282 4.9340 20.5610 20.2566 23.7694 16.8167 26.6843 15.6230 32.1702 28.9309 13.5955 19.5408
temp: 298.150 k
press: 1.00000 atm
elementType: 16 8 8 6 6 6 6 6 6 6 6 6 6 6 6 6 6 6 6 6 6 6 6 6 6 1 1 1 1 1 1 1 1 1 1 1 1 1 1 1 1 1 1 1 1
symmnumber: 1
zpe: 932147.3 jmol-1
zpe.correction: 0.355036 hartree
zpe.thermalcorrener: 0.377832 hartree
zpe.thermalcorrenthalpy: 0.378776 hartree
zpe.thermalcorrgfe: 0.300018 hartree
zpe.sumelectzpe: -1397.090183 hartree
zpe.sumelectthermal: -1397.067387 hartree
zpe.sumelectthermalent: -1397.066442 hartree
zpe.sumelectthermalfe: -1397.145200 hartree
dipole: -0.1402 -0.9024 1.2203
dipole: 1.5242
quadrupole: -141.8847 -148.0149 -146.4450
quadrupole: -4.6119 1.4398 -3.3451
quadrupole: 3.5635 -2.5667 -0.9967 -4.6119 1.4398 -3.3451
hfenergy: -1397.4452188 hartree
pointgroup: C01 [X(C22H20O2S1)]
dipole: 0.2614884 -0.4419867 -0.3096158 debye
polarizability: 267.1127421|5.2006041|264.9215968|20.9753279|0.8676424|224.7904078 unknown
InChI: InChI=1S/C22H20O2S/c23-21(24)16-17-25-22(18-10-4-1-5-11-18,19-12-6-2-7-13-19)20-14-8-3-9-15-20/h1-15,23H,16-17H2
charge 0 multiplicity 1
45 atoms
S  -0.732778 0.47925 1.85778
O  -5.097518 -2.309649 0.998055
O  -5.008795 -0.269759 -0.106942
C  0.483546 0.282513 0.321885
C  0.4409 1.516264 -0.614872
C  1.898629 0.240991 0.9522
C  0.060163 -1.026688 -0.36513
C  -2.43531 0.3551 1.032267
C  1.254475 1.495622 -1.782633
C  2.257186 1.185719 1.949905
C  -0.641051 -1.038133 -1.597523
C  -0.311417 2.68309 -0.344515
C  2.900309 -0.639079 0.46797
C  0.273323 -2.269981 0.295154
C  -3.084698 -1.016312 1.270579
C  1.300213 2.601864 -2.654743
C  3.567233 1.226808 2.471578
C  -1.102293 -2.251801 -2.161446
C  -0.266655 3.794955 -1.218194
C  4.215417 -0.592132 0.982698
C  -0.176223 -3.480131 -0.268484
C  0.535553 3.760367 -2.378615
C  4.555383 0.336602 1.990912
C  -0.868897 -3.478803 -1.504694
C  -4.461271 -1.109456 0.641585
H  -3.043033 1.168661 1.461282
H  -2.313627 0.559934 -0.042339
H  1.863913 0.612104 -2.003752
H  1.506581 1.895113 2.315454
H  -0.829061 -0.098803 -2.126833
H  -0.918153 2.728077 0.565744
H  2.656608 -1.367316 -0.312233
H  0.773363 -2.277212 1.269205
H  -2.457922 -1.823989 0.849144
H  -3.176352 -1.238352 2.349749
H  1.936521 2.562818 -3.546169
H  3.818362 1.958517 3.247682
H  -1.647126 -2.231201 -3.111883
H  -0.859048 4.687201 -0.985983
H  4.972692 -1.282107 0.593335
H  0.001995 -4.423437 0.259863
H  0.571595 4.621792 -3.05473
H  5.574285 0.370367 2.392453
H  -1.225395 -4.418572 -1.940664
H  -5.989323 -2.348214 0.556195
