program: Gaussian 09
title: 000026689
version: EM64L-G09RevD.01
frameworkgroup: C1[X(C10H11ClO3)]
method: RPBEPBE
basis: SDD
operation: Freq
keyword: #p
keyword: freq=noraman
keyword: PBEPBE/SDD
title: #p freq=noraman PBEPBE/SDD
converged: YES YES NO NO
title: Mulliken charges:
elementType: Cl O O O C C C C C C C C C C H H H H H H H H H H H
charge: -0.064308 -0.243874 -0.274311 -0.198844 0.358601 -0.388816 -0.316348 -0.353753 -0.217974 0.223308 -0.208838 -0.184386 -0.116601 -0.670418 0.243100 0.243610 0.233016 0.232712 0.251520 0.264403 0.253420 0.257717 0.215534 0.230684 0.230844
chargesum: 0.00000
title: Mulliken charges with hydrogens summed into heavy atoms:
elementType: Cl O O O C C C C C C C C C C
charge: -0.064308 -0.243874 -0.274311 -0.198844 0.358601 0.097894 -0.064828 -0.089350 0.247754 0.223308 0.044582 0.073332 -0.116601 0.006644
polarizability: 2.00373808e+02 -6.77531004e-01 1.20383055e+02 1.61599771e-01 4.94508254e-01 6.37092298e+01
1716.lowfreq: -2.5001 -0.0017 -0.0015 0.0015 2.8637 10.9440 16.7363 27.9218 48.4165
frequency: 15.7660 27.8102 48.3971 54.3803 96.5594 134.8782 151.5539 153.0347 193.4864 246.1267 247.8909 315.2393 316.8462 358.4943 407.1111 416.3858 481.7220 498.8587 565.8965 610.0322 623.4285 697.8636 698.8715 784.6341 799.2294 800.5526 826.9360 839.0628 915.7908 926.4898 956.3359 991.6215 1003.5107 1014.7585 1034.6726 1071.5072 1108.3343 1112.3104 1130.5209 1136.0659 1176.5278 1200.8851 1229.0412 1251.4987 1290.7536 1348.1731 1363.2918 1380.2910 1403.0308 1405.2036 1451.3331 1464.2993 1474.1668 1476.9286 1486.6811 1584.9005 1605.7944 1679.5307 2962.1491 2997.6393 3012.0188 3018.9052 3071.4890 3094.5577 3109.4168 3153.7550 3161.5017 3174.2266 3181.3144
redmass: 4.0895 6.0350 3.1228 5.0119 3.1151 5.6972 2.9948 3.2114 8.4780 4.4527 1.3930 5.7762 7.0522 4.1658 7.4644 3.0083 4.9561 2.7146 3.2632 7.7508 7.2196 3.4577 6.3148 5.1314 1.1044 1.3069 1.5171 4.4222 5.7162 1.3435 1.3414 4.0384 1.8609 2.9719 4.2715 2.5545 1.3774 2.2196 3.5781 1.4634 1.1597 1.0769 4.7472 1.1337 1.2596 1.4074 1.9696 2.8549 1.2702 3.7362 1.1539 1.0399 1.1060 1.9549 1.0708 7.3840 6.6984 10.7817 1.0554 1.0359 1.0582 1.1040 1.1069 1.0985 1.1028 1.0882 1.0887 1.0967 1.0978
irintensity: 0.0059 0.0536 0.4655 0.4729 0.0294 4.7472 9.4518 8.6949 0.0702 4.0108 2.2212 7.9457 1.7273 1.5511 12.2811 0.0786 0.3558 24.5353 3.3312 15.6183 1.1959 0.6557 25.6525 4.1076 8.4811 16.5321 73.0533 0.1466 11.8557 0.0001 0.3815 33.5141 0.4134 11.4315 216.7133 41.7200 52.8351 28.7675 495.9667 7.4506 10.4008 1.0340 181.8136 0.0219 0.3923 19.3994 8.5478 0.0171 21.2496 1.0670 114.8203 12.7034 33.9003 125.7714 15.0404 12.6959 21.3745 181.1813 40.9634 19.5941 18.6918 17.6408 7.2527 28.6100 43.8519 11.2800 1.7165 5.7251 1.0053
temp: 298.150 k
press: 1.00000 atm
elementType: 17 8 8 8 6 6 6 6 6 6 6 6 6 6 1 1 1 1 1 1 1 1 1 1 1
symmnumber: 1
zpe: 496583.5 jmol-1
zpe.correction: 0.189139 hartree
zpe.thermalcorrener: 0.203524 hartree
zpe.thermalcorrenthalpy: 0.204469 hartree
zpe.thermalcorrgfe: 0.144513 hartree
zpe.sumelectzpe: -1072.334130 hartree
zpe.sumelectthermal: -1072.319744 hartree
zpe.sumelectthermalent: -1072.318800 hartree
zpe.sumelectthermalfe: -1072.378756 hartree
dipole: -3.6624 -2.5996 -0.0016
dipole: 4.4912
quadrupole: -82.1739 -88.9078 -90.1364
quadrupole: 9.8983 -0.0511 0.2974
quadrupole: 4.8987 -1.8351 -3.0637 9.8983 -0.0511 0.2974
hfenergy: -1072.5232685 hartree
pointgroup: C01 [X(C10H11Cl1O3)]
dipole: -1.45858 -0.9929581 -0.093852 debye
dipolederiv: -0.8502879 0.1365988 0.0506249 0.1661576 -0.1598222 -0.0209194 0.0552951 -0.0197789 -0.0766167 -1.9920594 0.0138901 0.0654584 0.0598878 -0.2531682 -0.0009525 0.0708055 0.001651 -0.2696453 -1.7586883 -0.4057139 0.0115238 -0.5145731 -0.7067746 -0.0332588 -0.0021279 -0.0389024 -0.2911413 -0.7008544 0.1478453 0.0392085 -0.2166809 -0.8938516 -0.0733907 -0.008581 -0.090361 -0.2971003 1.678583 -0.1715077 -0.0867118 -0.4746358 0.0635745 0.0103316 -0.1369736 -0.0007967 0.1106368 0.6192082 0.1845687 0.0248848 0.774036 0.1365677 -0.0662871 0.1310018 -0.0457062 0.3672985 -0.2593148 -0.0251081 -0.0018895 0.3083451 -0.0577507 0.0137424 0.0547192 0.0259347 -0.2021496 -0.349975 0.0595344 0.0173502 -0.1267011 0.0530886 0.0421416 -0.0144959 0.0351472 -0.1611483 1.0142902 0.1382823 -0.0103752 -0.0444159 0.23976 -0.0143898 -0.0356639 -0.022493 0.3530887 1.7798418 0.1462338 -0.054898 0.591892 1.3483829 0.132827 -0.0013199 0.1547433 0.2072903 -0.1518518 0.108135 0.0203905 -0.0039072 0.0514723 0.0252737 0.0010632 0.0213245 -0.0920938 -0.1263681 0.0255139 0.0051025 0.0496805 0.0663654 0.0266742 0.009101 0.0273678 -0.0955887 1.1119131 -0.2578313 -0.085888 -0.2351062 0.0197153 0.0274619 -0.0817505 0.028244 -0.0865488 -0.0978394 -0.0902435 -0.0050619 -0.0708143 -0.0252838 -0.0078452 -0.0022386 -0.0070184 0.0595256 -0.0143024 0.0086671 0.0176232 -0.1460233 0.0307144 -0.0612777 -0.0496267 -0.0751616 -0.0608095 -0.0110609 0.0189148 -0.0139293 -0.1479097 -0.023067 0.0852673 -0.0047138 0.0877241 -0.0065704 -0.0542969 -0.038165 -0.0171516 0.0465485 0.0282101 -0.082893 0.0363618 -0.0841582 -0.0810345 -0.0561292 -0.0322089 0.0071816 0.0626898 -0.0224249 0.0943818 -0.0218473 0.1039958 -0.0298652 -0.0188126 -0.089804 -0.008853 -0.1163433 0.02607 -0.0205771 -0.0131418 -0.021664 0.1681012 0.078773 0.053713 0.0123559 0.0458368 -0.0065013 -0.0324349 0.0112759 -0.0325903 0.1681537 0.0728816 0.0431657 0.010604 0.0476613 -0.0245849 -0.0339302 0.0112519 -0.0337112 0.1583269 0.016918 -0.0778507 -0.0080307 -0.06883 0.0336833 -0.0199519 -0.0066056 -0.0196001 0.1621799 -0.1638229 0.0355562 0.017856 0.0540445 0.0626168 -0.0101137 0.0204427 -0.0092414 0.115802 0.1200797 0.0219037 0.0459327 -0.028274 0.0339814 -0.081242 0.0133622 -0.1009168 -0.0911717 0.1131755 0.0459103 -0.0533079 -0.0125651 -0.0209733 0.1013625 -0.0355938 0.1159675 -0.0289195 unknown
polarizability: 200.1176146|-1.3243038|118.9684845|-5.5312572|9.0074226|65.3799928 unknown
InChI: InChI=1S/C10H11ClO3/c1-2-13-10(12)7-14-9-5-3-8(11)4-6-9/h3-6H,2,7H2,1H3
charge 0 multiplicity 1
25 atoms
Cl 5.704971 -0.707581 -0.29278
O  -0.124508 0.766968 0.161976
O  -3.503502 -0.534805 0.104324
O  -2.739264 1.659687 0.371313
C  1.206798 0.333026 0.040591
C  -1.163607 -0.240847 0.02908
C  1.601844 -1.006166 -0.201488
C  2.181027 1.352989 0.179878
C  -4.919146 -0.059616 0.234012
C  -2.51598 0.449361 0.193189
C  2.97781 -1.320247 -0.302798
C  3.549496 1.039615 0.078953
C  3.930807 -0.297829 -0.161645
C  -5.810335 -1.290016 0.109748
H  -1.131312 -0.729557 -0.966338
H  -1.068655 -1.02943 0.803074
H  -5.023218 0.445297 1.21122
H  -5.106135 0.684284 -0.561286
H  0.868979 -1.810267 -0.313199
H  1.8476 2.37783 0.365837
H  3.294254 -2.350412 -0.489365
H  4.306038 1.822157 0.185588
H  -6.870683 -0.991756 0.199815
H  -5.670874 -1.782769 -0.867525
H  -5.587403 -2.021716 0.904824
