program: Gaussian 09
title: 000262678
version: EM64L-G09RevD.01
frameworkgroup: C1[X(C14H6F6N4O4)]
method: RPBEPBE
basis: SDD
operation: Freq
keyword: #p
keyword: freq=noraman
keyword: PBEPBE/SDD
title: #p freq=noraman PBEPBE/SDD
converged: YES YES NO NO
title: Mulliken charges:
elementType: F F F F F F O O O O N N N N C C C C C C C C C C C C C C H H H H H H
charge: -0.156161 -0.155935 -0.156746 -0.156161 -0.156746 -0.155937 -0.182597 -0.182597 -0.190769 -0.190767 -0.059054 -0.059065 0.026036 0.026025 0.333835 0.333835 0.183936 0.183967 0.268151 0.268154 -0.431353 -0.431359 -0.370590 -0.370581 -0.283060 -0.283070 0.269978 0.269979 0.316681 0.316675 0.282466 0.282466 0.305183 0.305181
chargesum: 0.00000
title: Mulliken charges with hydrogens summed into heavy atoms:
elementType: F F F F F F O O O O N N N N C C C C C C C C C C C C C C
charge: -0.156161 -0.155935 -0.156746 -0.156161 -0.156746 -0.155937 -0.182597 -0.182597 -0.190769 -0.190767 -0.059054 -0.059065 0.026036 0.026025 0.333835 0.333835 0.183936 0.183967 0.268151 0.268154 -0.114672 -0.114684 -0.088124 -0.088115 0.022123 0.022111 0.269978 0.269979
polarizability: 4.09650431e+02 -1.95907738e+01 2.43342618e+02 5.79564544e+00 -2.00773778e+00 9.03252968e+01
1716.lowfreq: -13.3371 -12.8870 -6.4442 -5.3239 -2.2088 -0.0011 -0.0009 -0.0007 16.3533
frequency: -13.2864 -12.8868 16.3533 24.4506 31.4083 59.8646 63.7948 85.3457 89.9611 107.5337 120.5656 130.4797 135.4843 142.6075 148.4228 203.1050 224.1870 263.5129 264.6298 285.7723 310.1158 317.2540 335.3139 356.2088 384.7534 385.3597 392.9078 409.2695 414.2277 433.9818 461.8478 471.6471 489.4498 503.5751 508.7239 560.2728 574.6212 588.2397 593.2982 611.7818 635.3145 652.1064 655.8855 680.8393 687.4608 697.5256 697.6271 726.9842 747.4900 772.7817 807.4835 847.7996 854.8381 868.8369 873.5821 929.4850 929.5068 982.6016 982.9204 997.7319 998.0914 1014.6643 1014.8828 1052.5298 1054.0021 1064.9630 1071.7874 1145.4116 1160.8441 1169.2480 1195.9073 1199.1027 1242.1608 1244.1362 1251.7280 1292.7642 1294.9512 1351.7919 1352.4015 1375.2827 1378.3884 1422.3739 1422.8368 1452.2843 1477.3569 1482.0593 1562.9099 1566.5128 1616.0711 1617.8372 3164.2335 3164.3088 3176.0136 3176.0165 3182.4641 3182.4719
redmass: 17.2214 18.8634 15.5622 11.9738 9.0719 9.7407 12.5651 13.1393 12.7462 14.8634 11.4616 10.0253 6.0829 10.3430 6.2080 10.7631 10.9526 11.9471 10.2958 13.7694 11.4754 13.0999 9.8329 9.3078 8.7642 10.6062 9.7494 4.7263 5.9809 5.9181 8.5669 7.9700 7.3239 13.0306 13.4026 7.2463 8.8261 5.7156 6.9917 5.9267 8.5204 8.5934 9.1079 4.7418 7.9735 12.1338 9.9433 7.1279 5.1919 8.0898 3.7025 6.3948 1.9759 3.1158 1.8874 1.4697 1.4692 1.6163 1.6196 4.7097 4.7451 6.5015 6.6566 4.0831 5.2159 6.2276 3.6773 2.0668 1.3772 2.1466 8.9483 7.1269 2.6309 1.7006 2.4302 2.5103 2.4893 9.2167 8.8521 6.3308 6.3619 4.6991 4.8718 12.3686 2.9616 3.1164 8.3158 8.4022 6.8965 6.9335 1.0900 1.0900 1.0931 1.0931 1.0972 1.0972
irintensity: 0.0002 0.0445 0.1912 1.4956 3.2909 0.0000 0.0000 3.1823 0.0000 0.0000 7.9870 7.0255 0.0000 0.0000 0.8835 0.0000 13.7381 0.0001 4.5760 15.6629 0.0000 3.1706 0.0000 0.0000 0.0013 9.1342 2.3146 1.3480 0.0000 0.0000 10.4911 0.0000 2.5068 0.0000 1.5986 0.0000 65.6859 24.7714 0.0000 18.0096 0.0000 0.0000 17.2067 0.0000 3.7274 0.1189 18.6377 0.0000 16.3877 8.5295 0.0000 0.0000 117.0782 61.7392 0.0000 5.3583 67.9088 67.7997 0.0007 0.0242 349.7195 388.5084 0.0010 0.0001 234.8833 0.0000 104.0007 0.0000 2.4220 0.0000 496.2860 0.0002 10.4786 0.0000 277.7350 521.0567 0.0001 457.0055 0.0057 0.0000 80.5150 27.3708 0.0003 0.0000 0.0000 10.7203 0.0000 50.5069 90.1184 0.0000 4.2226 0.0004 20.3572 0.5986 0.3563 0.0107
temp: 298.150 k
press: 1.00000 atm
elementType: 9 9 9 9 9 9 8 8 8 8 7 7 7 7 6 6 6 6 6 6 6 6 6 6 6 6 6 6 1 1 1 1 1 1
symmnumber: 1
zpe: 509130.2 jmol-1
zpe.correction: 0.193917 hartree
zpe.thermalcorrener: 0.216621 hartree
zpe.thermalcorrenthalpy: 0.217565 hartree
zpe.thermalcorrgfe: 0.139344 hartree
zpe.sumelectzpe: -1653.839533 hartree
zpe.sumelectthermal: -1653.816830 hartree
zpe.sumelectthermalent: -1653.815886 hartree
zpe.sumelectthermalfe: -1653.894107 hartree
dipole: 0.0000 0.0001 -0.0001
dipole: 0.0001
quadrupole: -189.6817 -172.2407 -158.5893
quadrupole: 10.5364 -1.3131 1.5829
quadrupole: -16.1778 1.2632 14.9146 10.5364 -1.3131 1.5829
hfenergy: -1654.0334509 hartree
pointgroup: C01 [X(C14H6F6N4O4)]
dipole: -0.0000056 -0.0000475 0.0000288 debye
polarizability: 408.6290179|-9.5934455|96.1991463|22.1762593|-29.6094961|238.490182 unknown
InChI: InChI=1S/C14H6F6N4O4/c15-13(16,17)7-1-3-9(11(5-7)23(25)26)21-22-10-4-2-8(14(18,19)20)6-12(10)24(27)28/h1-6H
charge 0 multiplicity 1
34 atoms
F  -6.452337 -0.545977 1.721233
F  -6.720845 0.887522 -0.018996
F  -6.660391 -1.342921 -0.394374
F  6.477975 0.142972 -1.782177
F  6.68581 0.941873 0.332706
F  6.746714 -1.288901 -0.040634
O  -2.941733 0.707906 -3.53934
O  2.967313 -1.109912 3.478667
O  -0.906837 -0.057183 -2.83213
O  0.93243 -0.344868 2.771384
N  -0.398524 0.179161 -0.351684
N  0.424191 -0.581164 0.291114
N  -2.150995 0.25213 -2.629802
N  2.176696 -0.653797 2.56919
C  -4.582905 -0.23917 0.203322
C  4.608561 -0.162843 -0.264048
C  -1.7815 -0.106191 -0.178108
C  1.807166 -0.295837 0.117455
C  -2.682108 0.064567 -1.267682
C  2.707795 -0.466423 1.207034
C  -4.073684 0.014255 -1.088139
C  4.099365 -0.416097 1.027458
C  -3.706741 -0.438665 1.297638
C  3.732373 0.036471 -1.358378
C  -2.315104 -0.364284 1.111401
C  2.340742 -0.037923 -1.172103
C  -6.075923 -0.309898 0.384349
C  6.101569 -0.091987 -0.445093
H  -4.728035 0.156222 -1.953232
H  4.753737 -0.557942 1.892555
H  -4.115623 -0.648089 2.290034
H  4.141231 0.245749 -2.350815
H  -1.620249 -0.484293 1.948233
H  1.645867 0.081936 -2.00894
