program: Gaussian 09
title: 000262676
version: EM64L-G09RevD.01
frameworkgroup: C1[X(C15H19N5O2)]
method: RPBEPBE
basis: SDD
operation: Freq
keyword: #p
keyword: freq=noraman
keyword: PBEPBE/SDD
title: #p freq=noraman PBEPBE/SDD
converged: YES YES NO NO
title: Mulliken charges:
elementType: O O N N N N N C C C C C C C C C C C C C C C H H H H H H H H H H H H H H H H H H H
charge: -0.257491 -0.310482 -0.389468 -0.431686 -0.042590 -0.631051 -0.688804 -0.512426 -0.414202 0.108744 -0.388922 0.300430 -0.039205 -0.820845 0.160514 0.136692 0.291043 -0.351416 -0.340813 -0.416279 -0.431579 0.503454 0.211437 0.236692 0.251232 0.239689 0.206980 0.241161 0.303035 0.301039 0.245669 0.218865 0.315193 0.270025 0.209520 0.219701 0.219328 0.352102 0.306194 0.308952 0.309571
chargesum: 0.00000
title: Mulliken charges with hydrogens summed into heavy atoms:
elementType: O O N N N N N C C C C C C C C C C C C C C C
charge: -0.257491 -0.310482 -0.086433 -0.130647 -0.042590 0.027244 -0.070282 -0.064297 0.076718 0.108744 0.059219 0.300430 -0.039205 -0.041118 0.160514 0.136692 0.291043 -0.081391 -0.131293 -0.196578 -0.212252 0.503454
polarizability: 2.76518401e+02 -2.91780168e+01 2.01532225e+02 -1.94882322e+01 -2.39903339e+01 1.61722076e+02
1716.lowfreq: -4.6905 -0.0006 -0.0004 0.0006 2.8227 6.8540 9.6725 16.6273 23.2232
frequency: 7.9440 16.2051 23.1631 43.3514 48.6333 52.0873 80.2573 100.2442 112.7757 144.7373 171.3697 188.6428 190.3753 211.1955 213.1265 260.4812 276.5715 302.2150 312.1258 317.3005 357.5865 368.1127 388.1592 388.6381 397.7747 409.1394 442.1306 479.6199 501.6526 504.9813 507.1679 522.5189 536.7025 557.6683 566.8657 586.0050 608.3516 620.0008 634.8008 685.5880 696.7679 738.9889 754.7932 766.9131 783.0711 809.5045 812.4153 829.4057 842.6323 867.2262 889.9203 934.2257 938.8707 949.2589 981.8283 997.1945 1018.1269 1029.4371 1042.2653 1047.4771 1060.7962 1074.2286 1123.7938 1131.8521 1157.4666 1165.0218 1192.7035 1200.0253 1220.7737 1242.6819 1277.4798 1289.4159 1305.5450 1309.5626 1323.5469 1324.8266 1348.4688 1357.0522 1380.9085 1383.4930 1411.9858 1438.0865 1448.3360 1452.3622 1457.2636 1464.9502 1471.4404 1490.7783 1495.1444 1524.8009 1555.7044 1558.2615 1588.6959 1591.6394 1630.8056 1631.7217 1645.5145 1657.8330 2970.9768 2980.9583 2996.3892 3009.1266 3043.7109 3045.4862 3054.4656 3084.4157 3109.0043 3111.0036 3122.7269 3135.2019 3158.6787 3535.0003 3554.6225 3563.4152 3566.3995 3703.2623 3707.7866
redmass: 3.4227 5.3873 4.5501 3.8836 5.2697 4.7391 1.3743 5.4012 4.3505 3.3550 3.0756 3.3832 4.8324 1.3170 2.4693 3.8472 4.5525 2.8347 4.7711 2.3346 4.4632 3.2048 4.6361 1.2342 1.0463 2.8339 4.0716 4.6608 2.5137 1.1610 2.6016 1.7723 3.6515 1.4498 2.7369 3.9218 6.2921 4.7164 6.7216 3.7021 9.2265 2.1559 4.5927 2.9453 3.3712 2.7135 1.7942 3.1387 1.8058 2.2987 3.3339 1.9350 1.4205 3.3586 1.3681 2.9538 1.4968 2.2157 1.6545 1.6250 2.2559 2.8931 2.5071 1.2920 3.3225 2.9496 1.2319 1.4478 3.5421 1.2930 1.5993 1.5799 1.3796 1.4736 1.9833 1.8274 1.2594 1.3872 3.3729 4.5153 1.2829 3.3637 1.6035 1.2898 1.6704 1.1694 1.1933 1.7792 1.0687 2.8557 6.2247 6.5336 1.5739 6.1964 3.0088 2.4803 1.4320 6.5661 1.0402 1.0614 1.0589 1.0624 1.0976 1.1000 1.1013 1.1020 1.0867 1.0962 1.0892 1.0961 1.0950 1.0770 1.0457 1.0454 1.0769 1.1040 1.1051
irintensity: 6.7043 2.4482 4.3212 5.9984 9.4117 6.2434 0.1486 2.2212 4.4895 0.1449 0.9834 3.4586 5.5787 70.4564 5.4310 15.0153 4.3906 3.6731 4.3553 3.6328 7.7635 12.4401 0.9116 254.4790 45.9410 2.0314 5.7086 1.3923 15.2822 299.7915 18.4180 82.2950 21.5807 20.1715 15.1708 2.9207 2.1240 7.7721 1.3061 26.5947 5.8517 11.5232 19.9617 5.2916 4.2326 8.5661 10.1049 4.6204 53.7304 7.8785 0.7764 2.4780 0.3232 10.4437 2.2618 0.7964 0.8976 1.8906 4.5848 4.5082 20.8951 2.9752 9.6235 23.2638 8.2080 5.2622 65.0836 42.5867 6.7789 51.2086 86.0326 103.8585 31.5956 64.7408 47.3660 25.2436 50.2577 7.2500 24.7023 2.1945 28.3830 10.9071 88.7439 63.4121 107.9117 51.3526 26.7441 324.5383 13.2344 25.9874 167.2285 407.5869 20.6326 98.8833 283.2442 226.1240 325.6227 218.7160 29.5414 48.0716 12.0330 55.4931 16.9023 10.1706 7.2188 25.3940 18.8876 3.6211 22.6290 21.0747 6.1343 18.7933 94.1941 102.3986 12.2689 22.3916 39.5886
temp: 298.150 k
press: 1.00000 atm
elementType: 8 8 7 7 7 7 7 6 6 6 6 6 6 6 6 6 6 6 6 6 6 6 1 1 1 1 1 1 1 1 1 1 1 1 1 1 1 1 1 1 1
symmnumber: 1
zpe: 865523.2 jmol-1
zpe.correction: 0.329660 hartree
zpe.thermalcorrener: 0.351833 hartree
zpe.thermalcorrenthalpy: 0.352777 hartree
zpe.thermalcorrgfe: 0.274694 hartree
zpe.sumelectzpe: -1005.631434 hartree
zpe.sumelectthermal: -1005.609261 hartree
zpe.sumelectthermalent: -1005.608317 hartree
zpe.sumelectthermalfe: -1005.686400 hartree
dipole: 5.3928 -7.3267 0.0191
dipole: 9.0975
quadrupole: -93.8038 -111.8752 -133.6545
quadrupole: 26.1595 -29.7797 -1.1998
quadrupole: 19.3073 1.2359 -20.5433 26.1595 -29.7797 -1.1998
hfenergy: -1005.961094 hartree
pointgroup: C01 [X(C15H19N5O2)]
dipole: -2.1148787 2.7616087 0.8435916 debye
polarizability: 274.613185|-36.3962933|184.0591711|13.2781818|29.6272337|181.1003464 unknown
InChI: InChI=1S/C15H19N5O2/c1-9-12(14(22)20-15(17)19-9)3-2-8-18-13(21)10-4-6-11(16)7-5-10/h4-7,18-19H,2-3,8,16-17H2,1H3
charge 0 multiplicity 1
41 atoms
O  4.034392 -1.339378 -1.789936
O  -1.372122 -0.92255 1.642528
N  -1.347482 -1.882279 -0.476079
N  3.858341 1.615366 1.00628
N  5.135778 0.314431 -0.549204
N  6.195083 1.941888 0.755839
N  -6.52098 2.104568 -0.877361
C  1.430525 -0.749077 -0.760263
C  1.115316 -1.950146 0.169904
C  2.668928 -0.000303 -0.315653
C  -0.159403 -2.729218 -0.233002
C  2.645148 0.979135 0.657124
C  3.968939 -0.397503 -0.937906
C  1.427679 1.476622 1.403348
C  -1.877431 -1.022398 0.470933
C  5.050686 1.260839 0.375382
C  -3.07656 -0.218976 0.057787
C  -3.871525 0.358467 1.083574
C  -3.451804 0.022015 -1.291966
C  -5.009794 1.121752 0.78477
C  -4.585383 0.790996 -1.608113
C  -5.392237 1.348563 -0.572012
H  0.555612 -0.075045 -0.799356
H  1.619952 -1.125508 -1.78269
H  1.000239 -1.598029 1.208919
H  1.966463 -2.657188 0.145053
H  0.024726 -3.290395 -1.167814
H  -0.38913 -3.462913 0.56506
H  -1.842934 -2.001727 -1.359335
H  3.842264 2.318384 1.746974
H  1.064433 2.433398 0.979457
H  1.659142 1.649418 2.472337
H  0.599877 0.752953 1.365373
H  -3.565104 0.189148 2.121291
H  -2.839307 -0.355145 -2.120822
H  -5.6126 1.549173 1.59549
H  -4.847375 0.974228 -2.657299
H  7.055546 1.661825 0.291467
H  6.201299 2.715011 1.414889
H  -6.798587 2.263709 -1.841504
H  -7.092507 2.507484 -0.140465
