program: Gaussian 09
title: 000262623
version: EM64L-G09RevD.01
frameworkgroup: C1[X(C15H21N)]
method: RPBEPBE
basis: SDD
operation: Freq
keyword: #pfreq=noraman
keyword: PBEPBE/SDD
title: #p freq=noraman PBEPBE/SDD
converged: YES YES NO NO
title: Mulliken charges:
elementType: N C C C C C C C C C C C C C C C H H H H H H H H H H H H H H H H H H H H H
charge: -0.118371 -0.093739 -0.007300 -0.514388 0.499741 -0.475696 -0.741987 -0.745013 -0.721938 -0.645115 0.505190 -0.450173 -0.387721 -0.220999 -0.224096 -0.250700 0.207577 0.176025 0.245459 0.194104 0.222933 0.220049 0.215276 0.234645 0.210562 0.231480 0.231569 0.214213 0.207267 0.218433 0.230773 0.184672 0.228371 0.246034 0.223215 0.223381 0.226269
chargesum: 0.00000
title: Mulliken charges with hydrogens summed into heavy atoms:
elementType: N C C C C C C C C C C C C C C C
charge: -0.118371 0.113838 0.168725 -0.074824 0.499741 -0.252763 -0.072017 -0.302972 -0.068889 -0.011238 0.505190 -0.221802 -0.141688 0.002216 -0.000715 -0.024432
polarizability: 2.04614683e+02 -1.62247848e+01 1.54393369e+02 -1.56256096e+01 -7.39552262e+00 1.29952161e+02
1716.lowfreq: -8.5736 -0.0004 0.0002 0.0002 6.4172 19.1752 28.2226 30.4588 46.4035
frequency: 27.5069 29.4974 46.1193 79.5299 133.9735 152.0962 189.5102 193.3018 198.2936 202.1435 240.1084 256.1277 316.0962 339.0623 345.3240 392.5946 403.0642 405.1499 422.1726 464.7728 500.5261 510.8695 590.7634 607.3847 617.3980 686.2982 699.7909 711.4788 758.9627 782.0594 834.9224 848.9742 856.0700 857.3844 880.6804 911.9798 931.2997 945.5618 974.8902 978.0801 990.0681 994.7411 1020.6795 1026.0565 1040.1631 1059.9380 1079.7293 1084.7076 1100.9470 1108.5206 1123.2453 1161.4585 1170.0183 1178.1939 1184.3223 1185.4419 1205.5173 1214.8028 1246.7362 1280.5730 1295.1351 1307.2774 1322.9151 1327.2885 1334.3488 1353.9568 1371.8785 1372.8845 1379.9879 1382.1044 1436.1598 1439.5558 1443.1922 1456.4159 1458.8296 1468.5941 1471.1044 1481.1216 1481.8005 1482.8581 1492.3830 1592.7232 1612.7118 1693.0327 2779.9740 2858.1274 2957.1895 2969.0831 2977.6955 2983.1276 2986.7665 3009.4699 3021.7420 3024.2359 3069.5801 3073.9185 3079.1036 3080.4050 3092.1570 3094.2445 3112.0825 3116.9760 3130.8008 3141.3224 3160.4048
redmass: 3.6658 3.5558 3.7993 3.0737 2.9627 2.5443 3.1904 1.2338 1.1652 1.1889 2.4183 2.6583 2.3871 2.5151 2.0913 2.4928 3.1940 2.8332 2.8265 2.7986 2.9875 3.4998 3.7688 3.0695 5.9367 3.3591 3.1597 1.5976 2.0478 3.0079 2.4152 1.6650 1.5337 1.6487 1.8440 1.4691 1.9512 1.7237 1.6235 1.3955 5.7864 1.3424 1.6802 2.1938 1.7953 1.7844 1.6058 2.5417 2.2445 1.3763 1.6094 1.7552 1.0694 1.4205 2.1467 1.1446 2.1438 1.6553 1.7971 1.5090 1.3865 1.8098 1.3904 1.3960 1.3600 1.5528 1.2500 1.3445 1.6368 4.7902 1.1628 1.8912 1.1578 1.1388 1.0506 1.0581 1.0502 1.0740 2.1179 1.0566 1.0511 6.1340 6.1067 7.6479 1.0785 1.0574 1.0595 1.0640 1.0378 1.0360 1.0783 1.0999 1.0984 1.0720 1.0991 1.0998 1.0995 1.0992 1.0951 1.0964 1.0867 1.0865 1.0910 1.0959 1.1014
irintensity: 0.0700 0.0542 0.1893 0.2247 0.3777 0.8994 1.2704 1.3135 0.6099 0.6443 1.1526 0.1730 0.7511 0.3265 0.1867 1.5032 4.9057 0.1877 0.6565 9.5993 7.3452 1.5799 5.9016 3.3683 0.7959 4.8163 1.7097 75.2576 24.6257 9.0496 3.9487 8.1809 0.6827 3.2112 11.2949 2.9266 8.4986 1.5733 4.9481 0.1141 0.1124 0.5768 7.8519 11.0218 9.7325 3.5734 9.5870 15.2794 6.5842 15.6316 10.7410 11.3948 0.1001 1.8437 8.0575 2.2910 1.1836 7.6326 26.1961 2.9157 4.5781 15.0179 2.6166 22.6748 6.0304 19.6747 17.3848 22.9707 12.2432 2.6760 6.6890 7.7659 4.5911 19.0912 12.0080 6.4893 16.6569 8.9894 15.3779 7.3972 6.9577 0.7391 12.0243 1.4578 87.8244 138.4362 29.8803 29.1384 27.0280 44.4206 40.0233 19.2852 16.0164 54.8998 33.9193 25.9507 41.5064 36.3993 31.4693 35.5239 9.1154 2.1088 9.7001 44.6515 29.6167
temp: 298.150 k
press: 1.00000 atm
elementType: 7 6 6 6 6 6 6 6 6 6 6 6 6 6 6 6 1 1 1 1 1 1 1 1 1 1 1 1 1 1 1 1 1 1 1 1 1
symmnumber: 1
zpe: 843094.2 jmol-1
zpe.correction: 0.321118 hartree
zpe.thermalcorrener: 0.337112 hartree
zpe.thermalcorrenthalpy: 0.338056 hartree
zpe.thermalcorrgfe: 0.276978 hartree
zpe.sumelectzpe: -637.708400 hartree
zpe.sumelectthermal: -637.692406 hartree
zpe.sumelectthermalent: -637.691462 hartree
zpe.sumelectthermalfe: -637.752540 hartree
dipole: -0.7279 -0.5884 0.2431
dipole: 0.9671
quadrupole: -91.9559 -94.4253 -97.3992
quadrupole: -1.9952 -1.4602 -0.6750
quadrupole: 2.6376 0.1682 -2.8058 -1.9952 -1.4602 -0.6750
hfenergy: -638.0295178 hartree
pointgroup: C01 [X(C15H21N1)]
dipole: 0.29961 -0.1887725 -0.1391258 debye
polarizability: 202.4759175|22.0872493|152.6423252|-11.6798062|11.3547502|133.8419712 unknown
InChI: InChI=1S/C15H21N/c1-12-9-15(10-13(2)16(12)3)11-14-7-5-4-6-8-14/h4-9,12-13H,10-11H2,1-3H3
charge 0 multiplicity 1
37 atoms
N  2.820768 0.177901 0.783078
C  2.288534 -1.206012 0.597155
C  2.681318 1.054149 -0.411818
C  0.768658 -1.121034 0.326606
C  0.450695 -0.127164 -0.778786
C  1.346444 0.840554 -1.105456
C  3.017265 -2.04292 -0.495296
C  -0.880588 -0.274567 -1.503724
C  2.827284 2.549799 -0.026514
C  4.171679 0.206906 1.375999
C  -2.114188 -0.177871 -0.600297
C  -3.189815 -1.089645 -0.744845
C  -2.222021 0.847389 0.375024
C  -4.350196 -0.977769 0.05546
C  -3.378708 0.962731 1.177312
C  -4.44935 0.050752 1.019998
H  2.434637 -1.718788 1.569272
H  3.492256 0.830224 -1.160536
H  0.246032 -0.823185 1.256507
H  0.378947 -2.123789 0.056189
H  1.120939 1.548394 -1.916123
H  4.109284 -2.06321 -0.323969
H  2.656738 -3.088206 -0.48081
H  2.83069 -1.632337 -1.503945
H  -0.908301 -1.253381 -2.026106
H  -0.947933 0.503778 -2.290793
H  2.084618 2.808876 0.748252
H  3.835646 2.781744 0.359205
H  2.655064 3.189321 -0.911776
H  4.20744 -0.490449 2.232277
H  4.402404 1.214857 1.761569
H  4.987667 -0.078825 0.664988
H  -3.118588 -1.892096 -1.490304
H  -1.390189 1.55131 0.502054
H  -5.172216 -1.691783 -0.07148
H  -3.446078 1.761315 1.92534
H  -5.346739 0.139331 1.642793
