program: Gaussian 09
title: 000262644
version: EM64L-G09RevD.01
frameworkgroup: C1[X(C19H30O3)]
method: RPBEPBE
basis: SDD
operation: Freq
keyword: #pfreq=noraman
keyword: PBEPBE/SDD
title: #p freq=noraman PBEPBE/SDD
converged: YES YES NO NO
title: Mulliken charges:
elementType: O O O C C C C C C C C C C C C C C C C C C C H H H H H H H H H H H H H H H H H H H H H H H H H H H H H H
charge: -0.205631 -0.267915 -0.269002 -0.165291 -0.407535 -0.367373 -0.386284 0.194425 -0.572389 -0.724489 -0.531096 -0.389839 0.515281 -0.257239 -0.440041 -0.379218 -0.354976 -0.360929 0.314225 -0.204854 -0.677216 -0.538433 0.210399 0.195062 0.228635 0.215633 0.181880 0.215196 0.206201 0.202058 0.207159 0.215127 0.225752 0.237530 0.229476 0.232504 0.242392 0.224177 0.177743 0.178504 0.228094 0.234587 0.235622 0.246629 0.183517 0.182750 0.200182 0.228622 0.229468 0.218777 0.218700 0.243441
chargesum: 0.00000
title: Mulliken charges with hydrogens summed into heavy atoms:
elementType: O O O C C C C C C C C C C C C C C C C C C C
charge: -0.205631 -0.267915 -0.269002 0.045108 0.016162 0.030140 0.035114 0.194425 -0.163172 -0.046079 -0.069115 0.076730 0.515281 0.099007 -0.211947 -0.144631 -0.119354 -0.114300 0.314225 0.161412 -0.018944 0.142485
polarizability: 3.00089897e+02 -4.79664101e+00 1.75062756e+02 -4.86212843e+00 -1.41998735e+01 1.83794340e+02
1716.lowfreq: -9.3151 -4.9208 -3.0227 -0.0010 0.0007 0.0013 5.1242 8.2830 20.3272
frequency: 4.7000 8.1062 19.8875 22.6082 35.4898 38.9590 45.4973 63.2726 82.8185 87.8818 94.5906 98.5071 110.3854 125.1357 140.1420 153.6504 167.9126 199.5930 211.6774 218.0884 222.7250 238.9964 242.4891 255.7640 281.7631 307.1647 333.9176 366.0334 400.2869 412.5487 421.0189 453.4934 456.8768 496.2530 516.9284 551.7184 566.6812 625.0846 633.7034 711.2579 733.4223 741.0198 757.1973 773.6853 803.5758 810.5006 815.0558 818.6658 838.2839 841.5439 860.3156 889.6802 909.8225 936.0917 963.4361 989.4552 990.6462 995.1605 999.4021 1003.3669 1014.9837 1026.6125 1046.4380 1067.8705 1070.7973 1072.8731 1078.3965 1091.7092 1097.8055 1108.5759 1111.5394 1124.4436 1129.4999 1134.9173 1155.5896 1159.4507 1168.2469 1177.7253 1214.7319 1227.4873 1232.7277 1242.3203 1246.5717 1250.2286 1257.2687 1267.4253 1275.2688 1280.9935 1288.7986 1303.4074 1309.1552 1327.7620 1337.9996 1345.4475 1351.8806 1357.6798 1383.1163 1384.8985 1389.8552 1408.0736 1416.5284 1432.1437 1435.2420 1453.0387 1459.6341 1463.3496 1465.1801 1468.0662 1470.3970 1473.4927 1473.7562 1477.1585 1480.0709 1484.5160 1484.9800 1495.0582 1502.2245 1585.1582 1624.7445 1629.5699 2891.2769 2913.0302 2936.7004 2944.1568 2951.8836 2954.8984 2956.4347 2966.0383 2971.4961 2974.0290 2977.7928 2979.3456 2993.9022 2996.8837 2999.4078 3015.5591 3019.5826 3039.4829 3040.4913 3051.8725 3074.0185 3084.2000 3086.0949 3091.5043 3101.3834 3117.4722 3120.6031 3121.9694 3157.2339 3163.7444
redmass: 5.1405 3.9437 2.1053 3.0747 3.9721 3.9674 4.3892 3.5956 2.6526 2.5148 2.2105 2.9630 2.0171 3.0331 2.6685 3.6996 3.0108 3.2297 2.6732 1.2909 1.5421 2.5375 1.1516 2.2289 3.1127 3.6830 2.6341 4.2606 4.0013 3.0522 3.6055 3.6318 3.2962 3.0874 3.2868 2.8353 2.2764 2.6981 6.7281 3.8924 1.1407 3.7382 1.2379 1.5031 2.1564 2.0242 1.0900 1.9325 1.8105 2.8107 1.3950 1.4937 1.8103 1.3832 1.3529 7.1579 2.6348 1.7580 3.5032 2.5816 2.8277 3.6985 1.9626 1.7693 3.7561 2.1099 2.4387 2.6706 2.4234 1.4989 1.2611 1.3510 2.1683 1.3805 1.3445 1.8835 1.3164 1.2422 1.9947 4.2215 1.2972 1.3953 1.2384 1.1965 1.2808 1.2321 1.1581 1.1688 1.1102 1.3404 1.3452 1.3262 1.4275 1.4178 1.5657 1.6795 4.8697 1.2197 1.2457 1.4796 3.2810 1.0927 1.1694 1.0789 1.0407 1.0725 1.0506 1.0785 1.0987 1.0748 1.0468 1.0678 1.0627 1.0679 1.1013 1.0802 2.4872 6.9788 6.4894 7.9986 1.0543 1.0547 1.1056 1.0632 1.0599 1.0332 1.1066 1.0592 1.0797 1.0604 1.0598 1.0394 1.0358 1.0936 1.0948 1.1007 1.0608 1.1033 1.1037 1.1038 1.0995 1.1027 1.1007 1.0991 1.1009 1.0892 1.0905 1.0975 1.0936 1.0951
irintensity: 0.0491 1.4610 2.7546 1.0870 0.1114 0.2209 2.5823 0.6351 0.3350 6.0443 1.6405 3.5277 0.0783 0.2369 2.9366 1.7760 1.1058 0.9989 1.4473 0.8495 0.6670 1.1931 0.5832 0.4090 5.4361 4.5923 1.7114 9.5941 1.4570 2.1182 6.4589 0.0684 3.4766 7.5047 13.6106 16.7212 2.0640 1.5120 0.2687 6.6942 9.9703 5.8429 5.7342 3.1315 10.3817 20.1984 5.0927 0.8630 40.1718 17.5458 0.6977 3.5349 1.0755 0.0754 0.3074 40.7689 6.3134 6.8978 18.5592 21.2409 29.8674 15.4963 3.8038 3.6720 120.7965 8.7561 19.9169 31.4867 5.9026 6.6854 0.2919 14.2282 35.4574 4.8624 0.4042 15.0369 3.6649 57.9196 27.6991 151.0562 9.3084 2.8917 10.4327 9.6528 13.3313 3.3708 2.9627 1.4065 3.1075 3.1994 0.3002 41.0905 12.3100 38.4447 0.8958 4.1287 8.4491 16.1859 25.8899 0.8701 2.5227 20.1126 9.3347 5.8293 10.7719 0.3789 12.7985 6.5193 0.7776 57.5593 17.3528 14.4178 11.6374 0.4177 17.4094 6.6427 130.3317 8.3075 33.2099 70.1710 41.8243 107.6315 68.9263 24.7300 15.9131 73.0439 64.4615 3.3718 21.8653 12.6424 86.4996 48.3067 26.7462 13.2981 12.9909 1.8020 14.1329 5.0720 53.0978 85.1337 44.3339 28.8840 27.1248 37.8994 38.2754 20.7841 35.8298 8.7190 18.6254 5.0862
temp: 298.150 k
press: 1.00000 atm
elementType: 8 8 8 6 6 6 6 6 6 6 6 6 6 6 6 6 6 6 6 6 6 6 1 1 1 1 1 1 1 1 1 1 1 1 1 1 1 1 1 1 1 1 1 1 1 1 1 1 1 1 1 1
symmnumber: 1
zpe: 1177611.7 jmol-1
zpe.correction: 0.448529 hartree
zpe.thermalcorrener: 0.474613 hartree
zpe.thermalcorrenthalpy: 0.475558 hartree
zpe.thermalcorrgfe: 0.384754 hartree
zpe.sumelectzpe: -965.933430 hartree
zpe.sumelectthermal: -965.907345 hartree
zpe.sumelectthermalent: -965.906401 hartree
zpe.sumelectthermalfe: -965.997205 hartree
dipole: 0.1941 2.0146 -5.1604
dipole: 5.5431
quadrupole: -109.8891 -132.4974 -136.6741
quadrupole: -2.9194 -5.3035 -0.8691
quadrupole: 16.4644 -6.1438 -10.3206 -2.9194 -5.3035 -0.8691
hfenergy: -966.3819588 hartree
pointgroup: C01 [X(C19H30O3)]
dipole: 0.1107563 0.7068164 -2.0601259 debye
polarizability: 299.2728365|-11.2576916|174.7636467|-5.4088228|-13.5536268|184.9105091 unknown
InChI: InChI=1S/C19H30O3/c1-4-22-15-7-10-19(20)16(2)8-5-6-9-17-11-13-18(21-3)14-12-17/h11-14,16H,4-10,15H2,1-3H3
charge 0 multiplicity 1
52 atoms
O  2.659331 0.696638 1.477018
O  7.038708 -1.688013 0.208095
O  -7.899026 -0.609759 0.770649
C  2.080381 2.259607 -0.313572
C  0.582434 2.15585 0.061205
C  -0.125596 0.924347 -0.547151
C  -1.624828 0.858322 -0.181985
C  2.91214 1.128817 0.320759
C  -2.338155 -0.383953 -0.784317
C  2.68661 3.614262 0.159235
C  4.072525 0.581253 -0.514343
C  5.071353 -0.281682 0.27807
C  -3.813689 -0.457133 -0.420014
C  6.123756 -0.915174 -0.636177
C  -4.821291 -0.055028 -1.327711
C  -4.223792 -0.902395 0.867382
C  -6.193526 -0.085412 -0.981676
C  -5.580945 -0.942176 1.233328
C  -6.572842 -0.530968 0.307489
C  8.096719 -2.350769 -0.567253
C  8.975091 -3.122921 0.41667
C  -8.95736 -0.195469 -0.150709
H  2.193316 2.196464 -1.416095
H  0.068276 3.079993 -0.272458
H  0.502162 2.116389 1.1649
H  0.373997 0.000195 -0.19116
H  -0.018079 0.940751 -1.652916
H  -1.735253 0.841582 0.920811
H  -2.13897 1.776116 -0.532824
H  -2.221807 -0.360502 -1.886093
H  -1.812951 -1.293485 -0.428826
H  3.759851 3.702027 -0.09253
H  2.1542 4.454583 -0.321661
H  2.580159 3.716731 1.254102
H  3.614095 -0.011695 -1.337683
H  4.57796 1.431172 -1.018514
H  4.529864 -1.074047 0.823779
H  5.57845 0.331964 1.044794
H  6.689812 -0.131865 -1.193816
H  5.640619 -1.583051 -1.388076
H  -4.53458 0.288123 -2.329822
H  -3.466225 -1.228383 1.591194
H  -6.941856 0.23095 -1.714968
H  -5.898198 -1.289103 2.221688
H  7.640424 -3.035892 -1.317662
H  8.692022 -1.588941 -1.120705
H  9.793612 -3.640743 -0.11605
H  9.416889 -2.435487 1.158509
H  8.376147 -3.874965 0.958536
H  -8.971124 -0.826517 -1.061332
H  -8.847359 0.868149 -0.440887
H  -9.89535 -0.33156 0.407676
