program: Gaussian 09
title: 000262778
version: EM64L-G09RevD.01
frameworkgroup: C1[X(C24H24O2S)]
method: RPBEPBE
basis: SDD
operation: Freq
keyword: #p
keyword: freq=noraman
keyword: PBEPBE/SDD
title: #p freq=noraman PBEPBE/SDD
converged: YES YES NO NO
title: Mulliken charges:
elementType: S O O C C C C C C C C C C C C C C C C C C C C C C C C H H H H H H H H H H H H H H H H H H H H H H H H
charge: 0.163658 -0.264693 -0.252956 -0.583343 0.407896 0.485144 0.489087 -0.673292 -0.390812 -0.403267 -0.391506 -0.359454 -0.353476 -0.355707 -0.461818 -0.261275 -0.254283 -0.244079 -0.257408 -0.239646 -0.250630 -0.249086 -0.245374 -0.245704 0.263090 -0.264164 -0.663229 0.267737 0.299742 0.269663 0.259899 0.253540 0.273524 0.246220 0.247111 0.287324 0.253429 0.229677 0.226266 0.225850 0.229761 0.224653 0.227081 0.230684 0.228566 0.228348 0.233054 0.222279 0.227196 0.248788 0.215937
chargesum: 0.00000
title: Mulliken charges with hydrogens summed into heavy atoms:
elementType: S O O C C C C C C C C C C C C C C C C C C C C C C C C
charge: 0.163658 -0.264693 -0.252956 -0.583343 0.407896 0.485144 0.489087 -0.105814 -0.121148 -0.143368 -0.137967 -0.085931 -0.107256 -0.108596 0.078934 -0.031598 -0.028017 -0.018228 -0.027648 -0.014994 -0.023550 -0.018402 -0.016808 -0.017356 0.263090 0.191169 0.028693
polarizability: 3.08562286e+02 -4.19110504e+00 2.75598861e+02 -1.77608373e+01 -7.65356494e+00 2.44058378e+02
1716.lowfreq: -7.9265 -6.1087 -1.3401 -0.0012 0.0003 0.0012 9.6447 15.7772 22.9102
frequency: 8.2278 15.4571 22.7717 37.0598 49.4712 55.3829 59.5198 67.5431 69.0254 85.5457 102.1243 109.3918 117.8437 129.0834 175.9696 199.9242 214.7809 220.6143 248.0945 260.8667 279.9631 280.9897 297.2388 310.2556 323.5318 344.0382 364.8369 400.1922 407.4939 411.8159 442.4519 480.3465 496.0874 525.3559 558.9617 612.8642 613.7309 616.0262 617.8236 625.6703 632.5401 664.6963 695.9562 703.8900 705.7882 712.9373 738.7817 744.8080 756.3995 775.4768 796.2461 819.6549 822.3121 852.3649 860.1855 860.9523 881.5281 887.2528 893.3286 932.8415 935.6928 943.1936 977.7936 980.3163 985.4956 987.2186 990.1538 990.6052 991.0525 996.9060 997.4028 998.8945 1010.3953 1027.5438 1030.7541 1031.0801 1070.3138 1082.3147 1088.0971 1090.4726 1095.8913 1121.3658 1145.5618 1151.1989 1158.0247 1171.6609 1172.9370 1173.3439 1184.3960 1193.5267 1195.0633 1198.4824 1214.6832 1236.6565 1272.8323 1278.5444 1309.5006 1319.8508 1326.6033 1329.8379 1357.4605 1370.1234 1375.8252 1378.4052 1389.9813 1427.5205 1432.2546 1436.4254 1439.5448 1447.9111 1458.0217 1463.4530 1475.0722 1478.0400 1479.8699 1484.7072 1581.3859 1586.4892 1588.1664 1605.3491 1605.7603 1609.2141 1634.4930 2992.0987 3013.5050 3027.6083 3041.1143 3067.4187 3087.1206 3091.5960 3116.4702 3117.7403 3122.5373 3122.7998 3125.3513 3129.9985 3130.4328 3134.0798 3142.7857 3143.0407 3147.3072 3150.0100 3150.7432 3154.8585 3164.0378 3164.3310 3166.6325
redmass: 4.6200 4.6715 5.5879 4.0586 4.5452 4.2513 4.4093 4.1632 3.7744 4.6483 4.1348 3.5515 4.0100 2.5571 3.7188 3.6245 1.3698 5.1611 4.2136 4.6382 5.2223 5.2813 3.3342 4.1082 6.8734 6.0386 4.1881 2.8286 2.8949 2.9096 3.2653 3.5314 4.0426 3.5714 2.8321 5.7119 6.2918 6.0780 6.0126 6.0914 5.7157 6.0265 3.8091 1.9270 1.8784 1.6868 1.7276 1.7031 1.7614 2.0337 1.6105 2.2601 3.5467 1.2514 1.2562 1.2485 4.4620 3.4995 3.7164 1.4862 1.5184 1.5736 1.7657 1.4085 1.4553 1.4483 4.7017 5.6383 5.4776 1.3097 1.3261 1.3057 2.8041 2.4693 2.1908 2.1659 4.3677 1.6465 1.6027 1.6203 2.1836 2.2195 3.1492 1.3622 1.6427 1.0645 1.0575 1.0512 3.4334 1.1289 1.1231 1.1291 4.0259 1.2703 1.1274 1.1206 1.4138 1.3632 1.3271 1.5259 1.3485 5.5678 6.9721 8.5028 1.2323 2.2251 2.2139 1.8895 1.2084 1.0954 1.0894 1.0452 2.1411 2.1393 2.1641 1.0521 5.7957 6.0626 6.1830 5.9489 6.0319 6.0351 8.8380 1.0361 1.0616 1.0594 1.0602 1.0985 1.0973 1.1033 1.1037 1.1059 1.0845 1.0844 1.0847 1.0875 1.0876 1.0880 1.0920 1.0921 1.0925 1.0953 1.0954 1.0955 1.1014 1.1014 1.1010
irintensity: 0.6486 0.3680 0.0604 0.2579 0.1901 0.2863 0.5817 0.0424 0.3480 0.1434 0.3801 2.4026 0.9453 1.2840 3.2288 0.2653 4.6117 0.4666 0.8511 1.0107 0.3704 0.2252 6.9582 16.7670 0.9631 4.6734 2.7062 0.1320 0.1899 0.4072 0.9712 2.9883 5.1642 1.7515 3.4425 11.1667 0.4813 5.7104 6.0642 6.0233 19.2959 18.1797 9.4626 42.1842 59.8595 54.9429 102.9215 8.8484 44.7008 22.9041 3.9545 10.5554 0.9194 0.6319 0.7684 0.5281 3.8523 2.7042 9.1309 0.2465 0.2304 0.3424 0.9994 0.5162 0.2930 0.4203 0.9260 0.5671 1.0217 0.3376 0.1892 0.2642 51.3708 1.1041 14.1586 13.3016 58.4474 3.0270 3.2752 13.9702 40.0573 238.6386 0.2272 58.3508 41.7327 0.1131 0.0818 0.0118 0.7798 1.9938 7.0932 1.5181 12.9180 32.8664 0.6391 4.2328 1.7131 4.1783 3.6294 80.7768 10.5015 0.3142 1.0919 0.5414 23.5954 4.6235 19.5822 14.1794 2.4345 26.4362 10.0739 13.0606 26.0551 7.9840 35.5545 12.4511 0.7659 2.1168 0.1304 7.5019 8.4210 2.8795 125.5510 22.8618 17.7369 28.2615 10.0574 0.9811 36.2030 0.5747 5.6060 33.5530 1.8491 1.5097 0.8247 1.2059 7.2316 4.9691 26.8987 13.9932 23.7391 9.8611 35.1112 17.0370 30.9480 29.8642 14.1752
temp: 298.150 k
press: 1.00000 atm
elementType: 16 8 8 6 6 6 6 6 6 6 6 6 6 6 6 6 6 6 6 6 6 6 6 6 6 6 6 1 1 1 1 1 1 1 1 1 1 1 1 1 1 1 1 1 1 1 1 1 1 1 1
symmnumber: 1
zpe: 1078200.6 jmol-1
zpe.correction: 0.410665 hartree
zpe.thermalcorrener: 0.436446 hartree
zpe.thermalcorrenthalpy: 0.437390 hartree
zpe.thermalcorrgfe: 0.350484 hartree
zpe.sumelectzpe: -1475.530857 hartree
zpe.sumelectthermal: -1475.505076 hartree
zpe.sumelectthermalent: -1475.504132 hartree
zpe.sumelectthermalfe: -1475.591038 hartree
dipole: -0.8343 -0.9155 1.0096
dipole: 1.5980
quadrupole: -145.4441 -159.9545 -159.0720
quadrupole: 3.7875 0.4043 -4.4528
quadrupole: 9.3794 -5.1309 -4.2485 3.7875 0.4043 -4.4528
hfenergy: -1475.941522 hartree
pointgroup: C01 [X(C24H24O2S1)]
dipole: 0.1899617 0.5833587 0.1373078 debye
polarizability: 302.8279501|13.9908936|278.1430191|20.3925428|-6.6981817|247.2485558 unknown
InChI: InChI=1S/C24H24O2S/c1-2-26-23(25)18-19-27-24(20-12-6-3-7-13-20,21-14-8-4-9-15-21)22-16-10-5-11-17-22/h3-17H,2,18-19H2,1H3
charge 0 multiplicity 1
51 atoms
S  0.322927 -1.071149 -1.643243
O  4.895272 1.369765 -0.881125
O  4.362138 -0.232721 0.731946
C  -1.000612 -0.444816 -0.327813
C  -0.502756 0.937835 0.12605
C  -2.340454 -0.41226 -1.105929
C  -1.181559 -1.450492 0.838421
C  1.943519 -0.931466 -0.666854
C  0.089625 1.142047 1.397943
C  -3.289147 0.623011 -0.903167
C  -0.549298 -2.71479 0.8911
C  -0.530252 2.032184 -0.784065
C  -2.7011 -1.500211 -1.943928
C  -2.086118 -1.107288 1.882424
C  2.754003 0.30822 -1.074765
C  0.627347 2.401013 1.756736
C  -4.551459 0.582691 -1.536767
C  -0.801261 -3.609316 1.957893
C  -0.004979 3.289276 -0.425621
C  -3.957542 -1.537042 -2.584527
C  -2.338241 -1.996518 2.946556
C  0.579333 3.482075 0.850993
C  -4.891492 -0.494365 -2.385016
C  -1.693783 -3.255691 2.992189
C  4.057479 0.41448 -0.297829
C  6.211862 1.60526 -0.20918
C  7.264419 0.617486 -0.720309
H  2.498604 -1.862089 -0.870972
H  1.700404 -0.916088 0.406324
H  0.132994 0.318414 2.117227
H  -3.044592 1.467457 -0.250635
H  0.128353 -3.007001 0.082309
H  -0.944948 1.88192 -1.786279
H  -1.994738 -2.324312 -2.092237
H  -2.604738 -0.142399 1.855314
H  2.166418 1.226439 -0.888427
H  2.981513 0.306733 -2.155784
H  1.086464 2.529019 2.743339
H  -5.268078 1.393873 -1.364596
H  -0.298585 -4.582991 1.974848
H  -0.0393 4.11613 -1.143927
H  -4.209596 -2.383198 -3.233665
H  -3.04139 -1.709821 3.736781
H  0.994995 4.457282 1.127846
H  -5.869198 -0.523603 -2.878783
H  -1.890218 -3.949047 3.81754
H  6.071239 1.512167 0.882187
H  6.455995 2.646103 -0.475733
H  7.354225 0.671461 -1.819047
H  7.003755 -0.41464 -0.432077
H  8.249755 0.859975 -0.280365
