program: Gaussian 09
title: 000262646
version: EM64L-G09RevD.01
frameworkgroup: C1[X(C20H17N3O5)]
method: RPBEPBE
basis: SDD
operation: Freq
keyword: #p
keyword: freq=noraman
keyword: PBEPBE/SDD
title: #p freq=noraman PBEPBE/SDD
converged: YES YES NO NO
title: Mulliken charges:
elementType: O O O O O N N N C C C C C C C C C C C C C C C C C C C C H H H H H H H H H H H H H H H H H
charge: -0.225612 -0.199511 -0.199514 -0.204864 -0.204873 -0.043722 0.021765 0.021760 -0.573108 -0.573502 0.304158 0.304465 -0.103343 -0.621517 -0.400927 -0.401029 0.458756 0.458639 -0.498831 -0.498898 -0.396413 -0.396440 0.355714 0.355738 -0.200341 -0.200319 -0.366848 -0.366860 0.255634 0.250243 0.250214 0.255872 0.208202 0.234551 0.234558 0.273852 0.273845 0.288576 0.288689 0.254855 0.254856 0.244123 0.244117 0.291645 0.291644
chargesum: 0.00000
title: Mulliken charges with hydrogens summed into heavy atoms:
elementType: O O O O O N N N C C C C C C C C C C C C C C C C C C C C
charge: -0.225612 -0.199511 -0.199514 -0.204864 -0.204873 -0.043722 0.021765 0.021760 -0.067231 -0.067416 0.304158 0.304465 -0.103343 0.055794 -0.127075 -0.127183 0.458756 0.458639 -0.210255 -0.210208 -0.141559 -0.141583 0.355714 0.355738 0.043782 0.043798 -0.075203 -0.075216
polarizability: 5.26021260e+02 -2.57146315e-02 2.80351752e+02 -2.41387393e-02 5.40357533e+00 1.22806267e+02
1716.lowfreq: -11.0455 -6.1022 -0.0012 -0.0003 0.0004 4.0066 11.1610 15.2055 20.2809
frequency: 10.0710 15.1322 20.0883 20.6005 43.5379 48.4394 55.7454 81.3845 85.6832 91.6011 109.3566 147.8381 171.9410 172.8372 202.5356 206.3764 225.3834 240.0135 255.6165 271.7408 286.7475 313.1976 345.4275 372.5126 382.4108 384.4647 423.0449 425.5318 428.6788 434.0369 453.5356 495.4586 496.7039 510.1542 524.3701 534.1120 579.2441 586.6950 637.0485 653.1634 659.3337 663.1059 689.2733 692.1835 701.3878 705.1458 706.0257 748.7180 757.6241 767.7311 818.5179 820.4972 841.8560 871.5758 908.8975 910.8932 923.0517 934.7591 948.8125 949.4628 951.7845 956.1229 981.1257 984.4605 988.3837 989.8685 1002.4205 1002.4522 1038.5501 1079.6503 1081.8968 1087.5867 1088.2160 1088.5689 1120.8208 1142.0849 1149.2677 1177.1413 1179.5689 1194.9155 1211.4230 1215.4375 1231.4385 1253.3178 1273.8368 1282.8328 1285.7416 1324.1317 1325.7873 1338.5678 1347.4173 1357.2291 1374.3566 1374.7024 1392.8935 1394.8193 1433.8480 1435.1217 1436.0967 1447.6040 1456.2686 1468.0529 1475.9500 1476.2372 1482.8625 1509.2365 1576.4052 1576.7989 1610.6812 1612.4294 1615.6596 1643.5346 2897.9644 2959.1499 2960.6799 3028.1766 3073.0449 3073.9950 3081.5196 3094.2474 3097.2162 3139.1918 3139.2048 3162.5865 3162.6351 3188.1120 3188.1394 3190.0863 3190.1167
redmass: 8.0705 6.8422 6.5757 3.7856 6.6985 11.8153 11.3884 5.1796 5.4711 6.9372 4.5740 4.9282 5.3200 5.1259 1.1097 7.0386 4.8407 4.5594 4.9934 4.8915 5.8029 4.1144 3.7016 2.6792 8.8875 8.6511 2.6994 3.2262 2.1585 2.9158 6.7271 6.1726 7.0131 5.4428 3.9027 6.5409 3.9585 6.5323 5.9072 6.2270 5.8344 7.1505 2.2790 2.1668 4.9201 6.5416 7.1818 5.0075 8.3459 6.6162 1.4974 1.5543 3.9495 6.4067 1.4372 3.9887 1.5649 1.7838 1.4619 1.4452 1.4704 1.5700 2.6218 3.7718 5.6165 4.9917 1.3620 1.3607 2.0886 2.1366 1.6817 1.8128 1.9477 2.1650 1.3766 2.2077 1.8026 1.2209 1.1617 1.9502 6.3156 6.4051 3.0805 2.8771 1.8051 1.3818 1.3621 1.2730 1.4009 1.5455 1.8889 2.1645 11.5173 11.4141 3.7611 3.2606 1.3568 2.7595 2.0464 1.1150 1.1187 1.0668 2.6030 2.6238 1.0581 11.5258 6.4669 6.4066 7.1485 6.9216 7.6605 8.8446 1.0515 1.0701 1.0704 1.0790 1.0867 1.0869 1.1009 1.0899 1.0914 1.0889 1.0889 1.0939 1.0940 1.0932 1.0933 1.0949 1.0949
irintensity: 0.0111 0.0384 2.6658 0.0177 2.4474 0.0196 0.2653 0.2360 7.4451 1.1911 0.5365 1.0056 1.2455 1.0670 0.1957 1.3603 1.1531 2.4567 2.2618 1.4759 4.2743 3.8054 12.6751 2.7987 1.0552 0.5176 0.7276 6.4410 0.0673 2.8917 2.6765 1.8549 9.8840 33.3986 11.3339 20.2272 1.0427 0.8442 27.0992 1.4059 13.1645 4.4357 86.8435 0.2128 10.6788 11.1144 2.8594 17.2526 1.7905 31.5376 0.2926 78.1666 0.0282 8.9681 2.0405 3.0099 2.7196 45.2437 0.0960 27.2169 0.8514 24.3175 8.0672 31.0761 0.0626 7.2139 0.3150 3.0464 32.3355 20.0462 18.2305 20.0943 26.8130 31.3681 0.8523 1.5069 271.7751 0.6256 22.5671 181.1566 284.9376 27.1770 143.5510 160.1291 13.1015 0.1395 3.7393 0.3218 75.8800 3.7394 20.0633 0.1412 207.8070 10.1367 8.4013 0.8004 16.8510 3.3471 2.8948 8.8774 13.3645 21.5366 6.4212 173.3534 7.1550 101.9104 8.3337 4.1453 92.6365 6.1803 53.8810 1.1919 63.7278 42.2455 11.6959 28.2796 5.3067 0.0829 17.0553 51.2080 9.1178 6.4885 2.0802 19.2109 12.8676 0.0574 0.2781 2.1042 8.5335
temp: 298.150 k
press: 1.00000 atm
elementType: 8 8 8 8 8 7 7 7 6 6 6 6 6 6 6 6 6 6 6 6 6 6 6 6 6 6 6 6 1 1 1 1 1 1 1 1 1 1 1 1 1 1 1 1 1
symmnumber: 1
zpe: 878734.8 jmol-1
zpe.correction: 0.334692 hartree
zpe.thermalcorrener: 0.359382 hartree
zpe.thermalcorrenthalpy: 0.360326 hartree
zpe.thermalcorrgfe: 0.275091 hartree
zpe.sumelectzpe: -1310.510130 hartree
zpe.sumelectthermal: -1310.485441 hartree
zpe.sumelectthermalent: -1310.484497 hartree
zpe.sumelectthermalfe: -1310.569732 hartree
dipole: -0.0012 -7.2808 0.9912
dipole: 7.3479
quadrupole: -167.5595 -182.0978 -163.1194
quadrupole: 0.0007 -0.0136 -1.4732
quadrupole: 3.3661 -11.1722 7.8062 0.0007 -0.0136 -1.4732
hfenergy: -1310.8448226 hartree
pointgroup: C01 [X(C20H17N3O5)]
dipole: 0.0016772 2.885279 -0.1801441 debye
polarizability: 526.0173316|-0.2864393|272.1953145|-1.2265537|-35.3220582|130.9666328 unknown
InChI: InChI=1S/C20H17N3O5/c1-21-12-16(8-14-4-2-6-18(10-14)22(25)26)20(24)17(13-21)9-15-5-3-7-19(11-15)23(27)28/h2-11H,12-13H2,1H3
charge 0 multiplicity 1
45 atoms
O  0.002175 2.715381 -0.909544
O  7.242612 -2.309819 0.370196
O  -7.23653 -2.300876 0.416032
O  5.041145 -2.900508 0.423462
O  -5.035464 -2.894099 0.455911
N  0.006193 -0.797706 1.411728
N  5.985529 -2.027765 0.305145
N  -5.979549 -2.020298 0.343117
C  1.219074 0.0484 1.453917
C  -1.203992 0.051827 1.462663
C  1.301191 1.057399 0.301321
C  -1.291872 1.059751 0.309661
C  0.003769 1.699166 -0.139727
C  0.000779 -1.821419 0.342977
C  2.432704 1.489631 -0.344691
C  -2.42666 1.492666 -0.330117
C  3.838071 1.058229 -0.211689
C  -3.831723 1.062981 -0.188305
C  4.231596 -0.288756 0.0090
C  -4.225468 -0.283462 0.035343
C  4.864536 2.034679 -0.38675
C  -4.858115 2.040528 -0.357521
C  5.600787 -0.607302 0.082988
C  -5.594541 -0.60037 0.118006
C  6.230435 1.693955 -0.295837
C  -6.223828 1.701434 -0.257984
C  6.619759 0.359946 -0.05456
C  -6.613218 0.36801 -0.013623
H  2.106922 -0.597837 1.509303
H  1.188697 0.619257 2.405968
H  -1.164551 0.623445 2.413915
H  -2.093257 -0.59175 1.525462
H  -0.002454 -1.412482 -0.694861
H  -0.89082 -2.462106 0.463263
H  0.891366 -2.464714 0.456646
H  2.262556 2.310553 -1.059787
H  -2.259841 2.31266 -1.047054
H  3.504613 -1.100863 0.073472
H  -3.499084 -1.096432 0.095555
H  4.576789 3.073058 -0.587521
H  -4.570416 3.07848 -0.560549
H  6.993993 2.46779 -0.422125
H  -6.987248 2.476102 -0.379928
H  7.66801 0.058905 0.01386
H  -7.661372 0.06823 0.061459
