program: Gaussian 09
title: 000262657
version: EM64L-G09RevD.01
frameworkgroup: C1[X(C25H24O2)]
method: RPBEPBE
basis: SDD
operation: Freq
keyword: #pfreq=noraman
keyword: PBEPBE/SDD
title: #p freq=noraman PBEPBE/SDD
converged: YES YES NO NO
title: Mulliken charges:
elementType: O O C C C C C C C C C C C C C C C C C C C C C C C C C H H H H H H H H H H H H H H H H H H H H H H H H
charge: -0.276327 -0.263279 0.102762 0.071191 0.132406 0.094513 0.166142 0.145549 0.374464 0.392856 0.114757 -0.700769 -0.820064 -0.820466 -0.403812 0.340335 -0.348381 -0.843890 -0.835295 -0.242689 -0.266053 -0.358344 -0.394722 -0.375668 -0.360653 0.311967 -0.537036 0.234116 0.223401 0.246997 0.242021 0.223459 0.256849 0.226123 0.245179 0.223988 0.230405 0.229620 0.229880 0.231427 0.228271 0.224740 0.224627 0.223070 0.218903 0.260085 0.249158 0.239566 0.221858 0.245281 0.221482
chargesum: 0.00000
title: Mulliken charges with hydrogens summed into heavy atoms:
elementType: O O C C C C C C C C C C C C C C C C C C C C C C C C C
charge: -0.276327 -0.263279 0.102762 0.071191 0.132406 0.094513 0.166142 0.145549 0.374464 0.392856 0.114757 -0.466652 -0.107645 -0.114035 -0.158634 0.340335 -0.124393 -0.153985 -0.150856 -0.018062 -0.042983 -0.139441 -0.134637 -0.126510 -0.121087 0.311967 0.151584
polarizability: 4.75751662e+02 -2.07600028e+01 3.30739821e+02 -8.22375594e+00 -3.77375742e+00 1.83973790e+02
1716.lowfreq: -6.7914 -0.0006 -0.0003 0.0002 2.0456 5.6260 22.8106 24.9832 33.2717
frequency: 22.7703 24.9746 33.1588 43.3164 62.5973 79.9058 90.5573 101.2474 114.2013 121.0253 132.8685 146.2728 166.7644 173.1760 182.8405 195.9291 200.6503 207.9510 221.5305 245.7124 281.8403 297.0703 324.3493 327.7818 332.9380 346.1301 348.6643 370.8924 408.7740 411.5975 432.7887 437.7939 464.7227 500.0435 506.6751 518.0797 540.7095 546.8902 575.8258 589.2959 599.1591 621.9417 636.7108 650.5377 655.0660 672.5246 731.3565 733.7259 748.4177 756.5630 765.3983 770.8002 810.8528 814.0791 830.1593 834.8376 851.1374 885.6045 934.0348 948.2301 954.5637 961.2419 963.1768 983.1566 986.2680 993.8451 998.8058 1001.0708 1014.4144 1021.9454 1023.9384 1030.4383 1047.4662 1052.8991 1055.4587 1066.8615 1085.1104 1103.7495 1112.0077 1122.7083 1151.6885 1158.1968 1168.0642 1180.5891 1207.9675 1236.2150 1243.8467 1249.1105 1284.6394 1305.0824 1312.4392 1348.1051 1358.2359 1376.9911 1384.7673 1393.4513 1396.5518 1404.1940 1405.3129 1410.9093 1430.1607 1436.7893 1445.2348 1454.8601 1458.9264 1461.2241 1466.9868 1472.3976 1472.8124 1475.4424 1477.1455 1481.0203 1485.2292 1486.7769 1487.1847 1509.1410 1543.5793 1559.8951 1571.0072 1581.4160 1605.7760 1622.2645 1633.6731 2959.6287 2967.7395 2969.5463 2970.8377 2978.7907 3040.1716 3044.5208 3044.8599 3047.4308 3058.4464 3079.5642 3080.7978 3095.0640 3105.2318 3112.3270 3124.9709 3127.4436 3140.0768 3149.2654 3154.5428 3158.0577 3169.0064 3170.6789 3181.1368
redmass: 3.5894 3.8019 4.1024 4.8576 3.5586 4.0299 1.2639 3.0972 2.6278 1.1241 2.6523 3.7829 1.5953 1.0466 3.3350 2.7198 2.9266 2.8520 2.1623 2.0508 4.0554 2.8627 3.9402 3.7173 3.7370 3.0080 3.0941 3.3091 4.8668 2.9912 2.8735 4.7403 4.1287 4.7094 3.7096 3.1000 3.0867 6.7715 6.3445 3.2639 3.9393 5.6055 5.9257 5.6063 5.3757 4.3836 3.9487 5.6739 3.5752 1.5542 3.6792 5.9355 5.3201 1.2714 1.7123 2.9932 1.5180 1.3104 5.4502 1.3756 1.3551 1.4905 2.1638 1.3141 8.0315 1.3530 2.4434 2.6328 1.5196 1.4307 1.5380 2.3453 2.6528 1.6261 1.9615 4.3988 2.5472 2.7985 1.2599 1.4830 1.9844 1.3800 1.1811 1.2996 2.0781 2.7887 2.1665 2.1976 2.2834 1.9456 1.9419 6.5289 4.0292 2.7295 2.7560 1.2383 1.3850 1.2165 1.1915 2.6383 3.9282 1.2346 2.0761 2.4579 1.1612 1.0861 1.0508 1.2340 1.0823 1.1889 1.1860 1.1467 1.1164 2.2375 1.3112 4.0142 5.6249 7.2194 7.2367 6.5630 6.2139 6.3658 7.4985 1.0329 1.0380 1.0383 1.0419 1.0403 1.0955 1.0960 1.0947 1.1039 1.0938 1.0985 1.0985 1.0984 1.0961 1.0910 1.0994 1.0850 1.0887 1.0872 1.0912 1.0933 1.0981 1.0963 1.0952
irintensity: 0.5521 0.8817 0.0887 0.9529 0.3533 0.3053 0.8959 2.9196 0.2848 0.8921 1.8482 3.9274 1.7283 0.2462 0.6655 1.1123 1.3674 0.9416 0.6313 1.5386 1.1210 2.7347 0.6884 4.2137 1.5218 0.3704 0.1091 2.7912 0.4981 0.0910 8.3010 0.2833 0.3502 2.3675 4.6422 11.6276 1.7431 20.8987 21.6620 0.0855 6.6651 1.1259 2.5723 10.3130 13.9050 1.1032 4.2633 13.7496 14.7154 49.7548 2.9781 10.7967 4.4898 0.6932 80.6618 2.2259 1.0082 8.6130 24.6699 0.3045 0.0923 6.4886 20.0782 0.1013 68.1982 6.6091 13.9013 9.9216 25.4061 1.4416 7.8141 1.0558 6.3256 0.4775 3.4613 12.8791 0.8735 13.0821 0.2112 5.6062 7.9259 6.0753 2.4032 127.5046 51.1915 206.9163 8.3243 3.3527 0.6463 7.3847 0.6410 0.1744 1.0138 3.8489 28.7233 0.2370 4.5660 35.7746 2.1208 44.6190 7.4921 14.8790 7.6348 19.3215 15.8788 9.4978 14.5342 17.1934 59.5212 6.6505 7.6053 39.3014 24.7807 70.2270 3.2266 104.3538 18.6045 10.6733 16.0024 0.3303 2.1493 83.8729 7.6420 96.5638 69.5650 40.1135 16.8924 19.0524 34.7090 26.7300 5.8631 48.2507 16.5144 18.7762 31.1262 14.7941 11.0980 34.5095 31.4993 3.6415 9.2609 13.9817 31.8716 6.8185 5.8169 26.8043 16.8738
temp: 298.150 k
press: 1.00000 atm
elementType: 8 8 6 6 6 6 6 6 6 6 6 6 6 6 6 6 6 6 6 6 6 6 6 6 6 6 6 1 1 1 1 1 1 1 1 1 1 1 1 1 1 1 1 1 1 1 1 1 1 1 1
symmnumber: 1
zpe: 1085527.4 jmol-1
zpe.correction: 0.413456 hartree
zpe.thermalcorrener: 0.438894 hartree
zpe.thermalcorrenthalpy: 0.439838 hartree
zpe.thermalcorrgfe: 0.357338 hartree
zpe.sumelectzpe: -1115.597712 hartree
zpe.sumelectthermal: -1115.572274 hartree
zpe.sumelectthermalent: -1115.571330 hartree
zpe.sumelectthermalfe: -1115.653829 hartree
dipole: -0.4420 -1.5112 0.5136
dipole: 1.6562
quadrupole: -141.2899 -139.4966 -159.6046
quadrupole: -9.1348 1.2283 -2.1905
quadrupole: 5.5071 7.3004 -12.8076 -9.1348 1.2283 -2.1905
hfenergy: -1116.0111676 hartree
pointgroup: C01 [X(C25H24O2)]
dipole: -0.1929347 0.6222899 -0.0103984 debye
polarizability: 470.8234788|18.3342667|318.4082515|34.6073927|44.6060035|201.233542 unknown
InChI: InChI=1S/C25H24O2/c1-15-14-16(2)18(4)23(17(15)3)25-22-9-7-6-8-21(22)24(27-25)19-10-12-20(26-5)13-11-19/h6-14H,1-5H3
charge 0 multiplicity 1
51 atoms
O  0.144799 0.286214 0.003257
O  6.461038 1.579497 0.578292
C  -2.327405 0.362346 -0.092766
C  -1.070891 -0.403858 -0.197401
C  -2.633842 1.037894 1.134312
C  -3.224297 0.411577 -1.208521
C  -0.759877 -1.755147 -0.421069
C  0.70002 -1.895746 -0.367992
C  -3.847622 1.773845 1.235892
C  -4.451061 1.125251 -1.078577
C  1.229365 -0.613121 -0.095715
C  -4.733151 1.793963 0.13333
C  -1.693298 0.963201 2.326343
C  -2.891005 -0.247935 -2.537085
C  -1.593492 -2.899912 -0.650895
C  2.555907 -0.038282 0.07787
C  1.284929 -3.186255 -0.597466
C  -4.215658 2.518946 2.508468
C  -5.43983 1.19956 -2.229662
C  -0.988576 -4.13784 -0.849681
C  0.448787 -4.276604 -0.834225
C  3.716476 -0.85633 0.238592
C  2.735029 1.374666 0.099586
C  4.988791 -0.288626 0.400238
C  4.007981 1.954418 0.265136
C  5.145451 1.120526 0.411803
C  6.67442 3.028378 0.601847
H  -5.673391 2.353288 0.221886
H  -2.252655 0.94823 3.277909
H  -1.058062 0.063502 2.287933
H  -1.012493 1.835944 2.358488
H  -3.103493 0.435351 -3.37979
H  -1.832382 -0.543154 -2.594815
H  -3.499539 -1.158396 -2.706952
H  -2.683037 -2.789949 -0.662289
H  2.369772 -3.323429 -0.602755
H  -5.137256 3.109069 2.366756
H  -4.390308 1.82604 3.354765
H  -3.41368 3.212086 2.824142
H  -6.366771 1.71319 -1.922171
H  -5.022425 1.752987 -3.093746
H  -5.715641 0.194496 -2.601002
H  -1.604588 -5.026927 -1.025043
H  0.88635 -5.265128 -1.013503
H  3.623739 -1.945027 0.264091
H  1.859442 2.019808 -0.019917
H  5.876503 -0.915445 0.527949
H  4.101402 3.044578 0.273456
H  6.361406 3.496948 -0.351548
H  7.757981 3.156769 0.73989
H  6.13224 3.501942 1.443458
