program: Gaussian 09
title: 000262610
version: EM64L-G09RevD.01
frameworkgroup: C1[X(C12H23N3O2)]
method: RPBEPBE
basis: SDD
operation: Freq
keyword: #p
keyword: freq=noraman
keyword: PBEPBE/SDD
title: #p freq=noraman PBEPBE/SDD
converged: YES YES NO NO
title: Mulliken charges:
elementType: O O N N N C C C C C C C C C C C C H H H H H H H H H H H H H H H H H H H H H H H
charge: -0.400131 -0.383825 -0.131205 -0.273954 -0.012020 -0.357372 -0.352468 -0.412010 -0.428530 -0.373176 -0.372728 -0.490088 -0.305337 -0.503951 0.324676 -0.039558 -0.682260 0.203666 0.196937 0.201132 0.190090 0.198875 0.205683 0.220025 0.180842 0.233423 0.220388 0.240480 0.224150 0.223326 0.237322 0.184787 0.205589 0.251257 0.189109 0.224646 0.211438 0.210593 0.368861 0.371320
chargesum: 0.00000
title: Mulliken charges with hydrogens summed into heavy atoms:
elementType: O O N N N C C C C C C C C C C C C
charge: -0.028811 -0.014964 -0.131205 -0.273954 -0.012020 0.043230 0.038754 -0.007453 -0.027662 0.080635 0.091902 -0.029440 0.085039 -0.063586 0.324676 -0.039558 -0.035584
polarizability: 1.87792815e+02 -1.67521607e+00 1.74566708e+02 -1.36852063e+01 -9.24400099e-01 1.27958603e+02
1716.lowfreq: -15.6872 0.0001 0.0006 0.0006 7.5287 11.3820 23.5331 34.5034 59.1270
frequency: 21.6138 34.2141 59.0344 69.5753 110.6968 148.5839 170.7144 177.5266 188.7733 214.0136 223.2101 227.0635 255.1196 279.6901 285.5111 302.2785 313.8718 330.1306 353.7634 369.2404 379.4489 400.2457 428.2813 439.8811 506.3675 510.0053 534.7658 556.5311 644.0088 676.5634 688.8771 727.1684 767.8815 788.3555 803.7106 825.3017 835.1977 866.2998 882.7019 889.5010 907.5489 913.7361 954.3543 980.2848 985.1407 1025.0279 1036.9156 1053.6082 1059.2216 1064.8195 1082.8680 1090.2758 1101.9293 1118.8166 1132.5274 1145.6004 1177.8652 1203.0392 1219.3614 1238.0635 1249.6090 1257.0330 1258.7043 1276.8004 1280.3374 1287.0837 1291.5651 1301.9917 1330.1501 1333.3371 1343.5730 1349.5603 1354.0789 1362.9050 1367.7526 1375.9688 1383.8200 1423.0071 1455.6877 1457.4845 1462.4347 1463.5262 1468.0835 1471.6787 1477.2522 1477.7584 1488.6782 1489.5299 1497.5142 1539.5041 1603.3302 2534.5976 2843.9267 2850.5362 2869.7926 2967.8884 2969.3080 2978.0320 2984.1122 3001.2724 3003.1767 3008.8441 3016.8189 3021.6893 3026.1961 3036.6955 3049.0925 3056.5442 3067.2996 3076.4076 3077.4823 3089.2488 3095.0527 3561.5002
redmass: 2.7966 4.1226 2.6543 4.0738 3.9547 2.7645 2.2679 2.7583 2.9644 3.5826 1.7621 3.9911 3.5067 2.3975 2.6005 2.1725 2.7703 2.7342 2.7776 2.3014 1.3679 2.6723 3.4277 2.6262 3.5023 3.9348 3.4557 3.7677 4.1957 2.1126 2.7483 1.3359 1.9298 1.1663 2.3436 1.8986 2.0919 1.1276 2.8993 3.4326 2.1433 1.8694 2.1255 4.2336 2.4771 2.3513 2.8865 2.5242 2.0200 2.4088 2.3871 2.1388 2.2255 1.8286 1.7038 1.6364 1.9091 1.6459 1.3350 1.3371 1.6108 1.4310 1.3551 1.1406 1.2583 1.2694 1.2285 1.2398 1.3949 1.4671 1.3848 1.4505 1.8701 1.3333 1.3158 1.3616 1.2318 4.8170 1.0945 1.0832 1.0858 1.0627 1.0939 1.0644 1.0711 1.0844 1.0702 1.0752 1.0883 3.6587 1.2840 1.0688 1.0722 1.0717 1.0721 1.0635 1.0607 1.0667 1.0356 1.0677 1.0659 1.0736 1.0891 1.0831 1.0865 1.0893 1.0881 1.0947 1.0993 1.0979 1.0982 1.1005 1.0980 1.0674
irintensity: 0.0099 1.3187 0.2061 2.2487 0.5592 0.1228 0.5242 0.5225 0.2828 3.1080 1.5224 4.8906 4.3639 1.4339 1.3921 2.5240 1.2465 4.7184 6.7864 1.7444 79.7780 39.6612 1.9937 7.9483 3.4189 11.3660 9.0890 3.7879 4.6109 14.4310 4.4679 15.7211 12.6061 12.2159 14.3816 7.0502 8.3245 116.9406 12.8101 69.4582 8.1204 5.1895 5.3820 85.3459 11.8386 17.5417 9.3934 6.2461 11.3099 19.6563 4.9534 9.4477 18.1535 15.6189 17.1235 34.9491 23.7646 24.6421 2.6030 4.3066 56.3225 8.0728 20.2808 3.1073 9.4464 9.1862 19.0751 0.4099 0.2054 9.2687 8.5353 3.4961 14.0864 2.3056 5.8388 1.8994 21.9800 31.4340 8.2266 6.4312 0.2743 3.8370 6.7541 3.3247 13.9129 8.4300 22.0344 10.0584 25.3828 3.2118 77.5105 134.3226 39.7117 128.7383 205.8744 26.6753 56.8996 28.9856 24.8320 27.8131 4.8692 7.1850 15.9660 31.9950 11.7102 46.8570 63.7257 10.8901 17.7460 29.3184 65.5840 44.8163 16.9139 63.4429
temp: 298.150 k
press: 1.00000 atm
elementType: 8 8 7 7 7 6 6 6 6 6 6 6 6 6 6 6 6 1 1 1 1 1 1 1 1 1 1 1 1 1 1 1 1 1 1 1 1 1 1 1
symmnumber: 1
zpe: 904029.8 jmol-1
zpe.correction: 0.344327 hartree
zpe.thermalcorrener: 0.362427 hartree
zpe.thermalcorrenthalpy: 0.363371 hartree
zpe.thermalcorrgfe: 0.298249 hartree
zpe.sumelectzpe: -784.283745 hartree
zpe.sumelectthermal: -784.265645 hartree
zpe.sumelectthermalent: -784.264701 hartree
zpe.sumelectthermalfe: -784.329822 hartree
dipole: 3.9050 3.4937 -1.7721
dipole: 5.5313
quadrupole: -111.3883 -103.1199 -104.6177
quadrupole: -17.7612 4.0194 5.5489
quadrupole: -5.0130 3.2554 1.7576 -17.7612 4.0194 5.5489
hfenergy: -784.6280718 hartree
pointgroup: C01 [X(C12H23N3O2)]
dipole: -1.5576071 -1.4159239 -0.5520565 debye
polarizability: 187.5979311|-0.3657709|174.2138802|14.1058947|-4.439574|128.5063146 unknown
InChI: InChI=1S/C12H23N3O2/c1-2-15-9-5-3-7-11(13-16)12(14-17)8-4-6-10-15/h16-17H,2-10H2,1H3
charge 0 multiplicity 1
40 atoms
O  2.866997 -2.586941 0.421986
O  4.129704 1.018329 1.025088
N  -2.630262 -0.068408 -0.073183
N  3.013376 -1.1349 0.439077
N  3.11891 1.708848 0.315545
C  -2.339526 -1.140958 -1.059386
C  -2.788759 1.286129 -0.663988
C  -1.473087 -2.290711 -0.476613
C  -1.483305 1.847561 -1.283961
C  -0.149425 -1.823149 0.173862
C  -0.289726 1.8295 -0.298437
C  0.878891 -1.25976 -0.858217
C  -3.724785 -0.43165 0.864652
C  1.10592 1.804478 -0.993501
C  2.025486 -0.508407 -0.207044
C  2.143338 0.974462 -0.249394
C  -3.654701 0.312027 2.212952
H  -1.80705 -0.688488 -1.914642
H  -3.278846 -1.578824 -1.481041
H  -3.110564 1.964445 0.147836
H  -3.597661 1.309327 -1.439324
H  -1.27047 -3.018163 -1.290133
H  -2.056661 -2.840213 0.289062
H  -1.686879 2.873583 -1.649536
H  -1.218816 1.257987 -2.186064
H  0.323049 -2.661958 0.715123
H  -0.399554 -1.044989 0.917123
H  -0.412216 0.936298 0.337176
H  -0.339586 2.697738 0.385858
H  0.368963 -0.591399 -1.568918
H  1.297795 -2.108837 -1.431219
H  -4.729842 -0.26844 0.396706
H  -3.64692 -1.516878 1.061862
H  1.516855 2.824883 -1.082979
H  0.998779 1.417001 -2.027194
H  -2.67519 0.140948 2.693123
H  -3.791554 1.40208 2.097449
H  -4.449164 -0.050584 2.891523
H  3.93688 -0.01324 0.966866
H  3.681211 -2.89633 0.89711
