program: Gaussian 09
title: 000262551
version: EM64L-G09RevD.01
frameworkgroup: C1[X(C10H12N2S)]
method: RPBEPBE
basis: SDD
operation: Freq
keyword: #p
keyword: freq=noraman
keyword: PBEPBE/SDD
title: #p freq=noraman PBEPBE/SDD
converged: YES YES NO NO
title: Mulliken charges:
elementType: S N N C C C C C C C C C C H H H H H H H H H H H H
charge: -0.060134 -0.458555 -0.112727 0.278817 0.250862 0.008476 -0.446958 -0.565366 0.491289 -0.349055 -0.353062 -0.707302 -0.817583 0.258052 0.211473 0.308317 0.238853 0.247336 0.263005 0.267200 0.229139 0.231852 0.221172 0.231648 0.133251
chargesum: 0.00000
title: Mulliken charges with hydrogens summed into heavy atoms:
elementType: S N N C C C C C C C C C C
charge: 0.073117 -0.150238 -0.112727 0.278817 0.250862 0.008476 0.022567 -0.326513 0.491289 -0.101719 -0.123923 -0.177097 -0.132911
polarizability: 2.07554983e+02 9.67920921e+00 1.36454306e+02 -6.40442430e-01 3.47015703e-01 7.26332323e+01
1716.lowfreq: -14.2611 -8.2148 -6.4560 -0.0009 -0.0004 0.0012 3.2532 58.0541 72.2437
frequency: -11.2600 58.0492 72.2427 100.0022 151.2260 182.6460 230.8331 279.1624 302.5588 353.9970 386.5629 428.3339 433.1948 467.6748 526.4525 579.1026 593.7874 609.3279 617.8775 646.3658 682.3527 754.7135 759.8505 771.1392 822.6958 834.3036 865.0121 925.1154 939.4742 947.3069 960.0546 1003.3261 1005.6407 1037.9190 1045.4504 1128.2171 1153.0952 1164.1509 1182.1252 1217.9227 1232.2244 1269.4647 1288.3615 1293.6702 1324.8137 1380.2419 1385.3692 1398.9190 1441.1046 1442.2105 1454.4865 1469.2159 1472.8862 1492.5210 1530.0082 1591.5760 1641.9660 2253.7733 2958.8468 2975.3648 3009.7849 3041.8874 3053.3554 3081.6255 3112.9664 3127.6994 3135.1274 3166.0469 3594.4625
redmass: 5.3694 1.0904 4.5757 3.8640 3.2976 4.4817 3.0964 3.0668 3.0842 3.8510 3.1815 3.7005 3.0357 1.2026 3.1173 4.1832 1.3251 2.8775 4.5300 3.8661 4.0416 4.4879 1.3451 3.5869 1.4335 3.8450 1.4769 2.1149 2.6987 2.6506 1.3364 1.5317 2.3035 2.9430 1.5409 1.5350 1.7902 1.2010 1.4615 2.1954 1.3491 2.2418 2.4118 1.2876 1.6770 2.5148 3.4540 1.2664 1.2829 1.1179 3.0410 1.0466 1.2822 2.7613 3.9522 7.2063 7.3388 1.0374 1.0606 1.0371 1.0953 1.0606 1.0977 1.0987 1.1074 1.0891 1.0924 1.0959 1.0813
irintensity: 2.2299 0.8237 5.5001 2.3844 2.7204 7.9020 3.9158 2.2168 0.2628 4.3290 1.0484 18.3151 15.6287 61.6079 2.0556 1.4422 58.2935 39.7426 3.7929 10.0870 1.2626 4.7661 62.7641 0.8005 58.7517 20.1862 7.2316 2.7203 1.6362 8.1914 1.1084 8.7486 10.6523 2.1190 13.2489 2.5111 1.5612 3.1933 13.4765 8.3796 1.9516 47.7224 3.2707 12.2882 51.8793 41.7478 0.5678 8.1306 20.2464 10.3176 19.0285 12.9695 17.8747 15.5187 20.5898 5.2979 15.5812 214.1282 35.1763 43.0665 5.5768 39.2123 21.1843 20.3951 15.9649 15.0341 14.7595 9.3599 41.0809
temp: 298.150 k
press: 1.00000 atm
elementType: 16 7 7 6 6 6 6 6 6 6 6 6 6 1 1 1 1 1 1 1 1 1 1 1 1
symmnumber: 1
zpe: 519414.0 jmol-1
zpe.correction: 0.197834 hartree
zpe.thermalcorrener: 0.209225 hartree
zpe.thermalcorrenthalpy: 0.210169 hartree
zpe.thermalcorrgfe: 0.159970 hartree
zpe.sumelectzpe: -894.896091 hartree
zpe.sumelectthermal: -894.884700 hartree
zpe.sumelectthermalent: -894.883756 hartree
zpe.sumelectthermalfe: -894.933955 hartree
dipole: -3.3330 4.5697 0.4117
dipole: 5.6710
quadrupole: -87.7670 -73.0910 -88.7316
quadrupole: 10.2919 3.6160 -1.0878
quadrupole: -4.5705 10.1056 -5.5351 10.2919 3.6160 -1.0878
hfenergy: -895.093925 hartree
pointgroup: C01 [X(C10H12N2S1)]
dipole: -1.1055939 -1.93567 0.0941494 debye
dipolederiv: -0.3377532 -0.0658478 0.0925126 -0.0673211 -0.2899916 0.0490171 0.0485783 0.0129766 -0.2486894 -0.710879 -0.0952469 0.0070361 0.0625163 -0.458484 0.057993 -0.0333422 0.0671829 -0.287704 -0.7202261 0.0898726 -0.0723727 -0.0353033 -0.5008418 0.0783874 -0.1471497 0.0757622 -0.2680259 0.2003161 -0.1739568 0.0545744 -0.4760767 0.0963557 -0.0288279 0.1517114 -0.0150993 0.0852087 0.5093684 0.197807 -0.0094586 0.1731136 0.6058542 -0.1651437 0.0728878 -0.2058569 0.0972367 0.3820161 -0.1161581 0.048126 0.0518039 -0.0977929 0.0219603 -0.0108246 0.0297535 -0.005346 -0.0079252 -0.0181726 0.0401566 -0.0742712 -0.0275986 0.0440319 -0.1038723 0.0306379 0.0542282 -0.0814156 0.0532841 -0.0073739 0.0692991 0.0046309 -0.0651926 -0.0159893 -0.065337 -0.1905388 0.3311246 0.040895 0.0027521 0.202221 0.0437395 -0.0106697 -0.04151 -0.0214967 -0.0291149 0.1211557 -0.0077382 0.0160867 -0.043236 0.0943465 -0.077565 0.0239816 -0.0717328 -0.1123326 -0.2519799 -0.0670103 0.0136774 -0.2636153 -0.0015057 -0.0755377 0.080142 -0.0651569 -0.1807161 0.1069027 -0.0463057 -0.0529112 0.1659512 0.3282208 0.0949678 -0.0267395 0.0591411 0.1223848 -0.145143 -0.0284272 -0.0011536 0.0415642 0.0826283 -0.0025405 -0.0288814 -0.0058126 0.0694836 -0.0569614 0.0291589 -0.0265525 0.0208393 0.1086949 -0.0027666 -0.0370619 0.0501302 -0.0877488 -0.0247953 -0.0676347 -0.0040021 0.0179366 -0.1890044 -0.0568378 0.0536518 -0.063481 0.0925743 0.1713989 -0.0001854 -0.004038 -0.0169797 0.1855398 0.0452459 0.0054103 0.0371504 0.3264468 0.0425421 -0.0516661 0.0101198 -0.0706687 -0.0676798 0.0708698 0.0166224 0.0726439 0.1521203 0.0809396 -0.0617241 0.0158984 -0.0306261 -0.0371493 0.0607314 0.0049165 0.056528 0.1419797 -0.1370438 0.0631844 -0.0012115 0.0511399 0.0092472 -0.0166615 -0.0217923 0.0056941 0.1063971 0.1007555 -0.0272249 -0.0726102 -0.0453999 -0.0268296 -0.0459617 -0.0083279 -0.0459114 -0.1266667 -0.045535 0.1067207 -0.042123 0.0999193 0.0083474 0.049703 -0.0389141 0.0489992 0.1377971 -0.0372251 -0.0156711 -0.0669761 -0.0206927 0.0992415 0.0418538 -0.1334041 0.0124245 -0.0877439 0.0582463 0.0171703 -0.0072687 -0.1064 -0.1250242 0.0715565 0.0334631 0.0759616 0.0832033 -0.0509713 0.0309863 0.0597668 0.071268 0.0091173 -0.1051378 0.1171222 -0.0760288 0.0205293 0.5030878 0.2138906 0.0073451 0.223018 0.145938 -0.0334754 0.039322 0.0009272 0.1350371 unknown
polarizability: 208.0887927|-0.5186051|133.5188761|9.9586005|-10.1370601|75.0348525 unknown
InChI: InChI=1S/C10H12N2S/c1-7-2-3-8-9(6-7)12-10(11-8)4-5-13/h2-3,6,12-13H,4-5H2,1H3
charge 0 multiplicity 1
25 atoms
S  4.119331 1.634518 0.344976
N  0.527299 -1.502048 0.352082
N  1.156785 0.591865 -0.268851
C  -0.670062 -0.814254 0.093434
C  1.594488 -0.619822 0.121372
C  -0.255095 0.501576 -0.297162
C  3.030856 -1.028186 0.325249
C  -2.026062 -1.195355 0.156259
C  -2.997622 -0.224908 -0.182306
C  -1.228964 1.467635 -0.634045
C  -2.583807 1.090036 -0.571227
C  4.039619 -0.108455 -0.392076
C  -4.478651 -0.563102 -0.139356
H  3.266377 -1.038087 1.408678
H  3.164656 -2.067874 -0.041978
H  0.615176 -2.472626 0.648002
H  -2.331601 -2.204055 0.455946
H  -0.929381 2.476368 -0.933549
H  5.059307 -0.512367 -0.288284
H  3.795228 -0.018076 -1.462915
H  -3.356062 1.825137 -0.828068
H  -4.944797 -0.449546 -1.136397
H  -4.651644 -1.600761 0.194645
H  -5.023619 0.107602 0.551266
H  2.762644 1.850087 0.067204
