program: Gaussian 09
title: 000262768
version: EM64L-G09RevD.01
frameworkgroup: C1[X(C22H20O2S)]
method: RPBEPBE
basis: SDD
operation: Freq
keyword: #p
keyword: freq=noraman
keyword: PBEPBE/SDD
title: #p freq=noraman PBEPBE/SDD
converged: YES YES NO NO
title: Mulliken charges:
elementType: S O O C C C C C C C C C C C C C C C C C C C C C C H H H H H H H H H H H H H H H H H H H H
charge: 0.184299 -0.258218 -0.245662 -0.587888 0.486670 0.440547 0.382786 -0.373998 -0.322719 -0.377267 -0.389843 -0.404517 -0.354610 -0.739858 -0.246768 -0.245054 -0.252052 -0.260105 -0.247210 -0.259134 -0.248828 -0.243674 -0.240079 0.320635 -0.502075 0.258228 0.259147 0.267126 0.286432 0.262135 0.283211 0.296990 0.289125 0.226141 0.226937 0.228643 0.233932 0.226619 0.230891 0.226608 0.229023 0.230275 0.245701 0.235244 0.242213
chargesum: 0.00000
title: Mulliken charges with hydrogens summed into heavy atoms:
elementType: S O O C C C C C C C C C C C C C C C C C C C C C C
charge: 0.184299 -0.258218 -0.245662 -0.587888 0.486670 0.440547 0.382786 -0.115770 -0.063572 -0.110140 -0.103410 -0.142382 -0.071400 -0.153744 -0.020627 -0.018117 -0.023409 -0.026173 -0.020591 -0.028243 -0.022220 -0.014651 -0.009803 0.320635 0.221083
polarizability: 2.84317750e+02 6.27654202e+00 2.58514924e+02 -1.28692421e+01 -2.03924804e+00 2.39960274e+02
1716.lowfreq: -11.4505 -7.6112 -2.9194 -0.0010 0.0009 0.0010 17.4230 24.2404 33.8930
frequency: 16.0252 24.0483 33.8532 46.3539 48.9965 58.0538 69.0370 77.6799 80.3924 92.8471 97.9127 129.5421 165.4123 175.7618 218.8187 232.7377 257.4630 259.7924 269.5707 274.0888 296.1398 311.7255 336.6081 387.4445 400.1638 402.9873 408.5542 485.2694 500.7107 516.3829 562.5050 612.2872 613.8058 614.8055 623.2015 624.5464 646.9021 659.6596 703.3821 706.9677 709.5622 732.5075 734.7562 765.6035 771.8193 787.2629 812.1098 855.0214 859.2610 864.4985 882.0823 884.9209 897.2640 934.1823 939.7187 945.2189 976.5249 981.9133 984.8996 987.5893 989.1186 989.6688 990.2471 997.6926 1000.3811 1001.0904 1027.0400 1030.7909 1031.6798 1086.6850 1088.4692 1091.2312 1096.7262 1113.5811 1145.8554 1149.7992 1172.2181 1173.4892 1173.7453 1195.5225 1196.7009 1199.5653 1201.1999 1211.4319 1213.4639 1245.2913 1317.9781 1321.0967 1327.5371 1372.5564 1374.7222 1378.9572 1420.1586 1427.1811 1428.8762 1430.5615 1436.2590 1452.9708 1463.2036 1478.0677 1479.6448 1480.8619 1583.3290 1586.1354 1588.5360 1605.1310 1605.4507 1609.0161 1630.4945 3006.1593 3059.7331 3108.4982 3122.6586 3123.1285 3123.5204 3130.4011 3132.2212 3133.8122 3143.0807 3143.6510 3144.7139 3145.7925 3151.9109 3155.2404 3157.5510 3158.7142 3166.2656 3169.1835 3169.9658
redmass: 4.3925 4.6571 4.3076 5.1866 4.4090 5.2062 4.3624 5.0286 4.8326 2.0060 1.5670 4.2455 5.6810 7.6279 5.3483 4.7323 3.7389 4.5099 4.4671 5.1597 4.9370 5.3454 8.2390 2.8351 2.8328 2.8559 2.8982 3.8940 3.8150 3.6918 7.4322 6.2825 6.2398 6.2387 5.8259 6.1231 5.8962 5.6739 1.8620 1.8405 1.8044 2.2987 6.1312 1.8576 1.9667 4.1177 3.1022 1.2485 1.2457 1.2482 3.6011 2.8941 2.5393 1.5012 1.4728 1.7011 6.2287 1.4042 1.5228 1.7694 3.6528 5.6177 3.4774 1.3167 1.3063 1.3389 2.5068 2.2181 2.1292 1.6254 1.6319 1.6387 1.5848 1.2704 3.1548 1.4370 1.0549 1.0537 1.0523 1.2077 2.0297 1.2655 1.2162 1.9865 2.2991 1.7269 1.3918 1.3626 1.3222 6.0565 6.7389 8.1806 1.1478 1.2023 2.1727 2.0946 2.2532 1.0497 1.0509 2.1435 2.1318 2.1600 5.8177 5.8812 6.0775 5.9984 5.9396 6.0026 9.1279 1.0295 1.0567 1.1046 1.0847 1.0848 1.0850 1.0881 1.0881 1.0884 1.0934 1.1080 1.0941 1.0937 1.1049 1.0952 1.0962 1.0969 1.1003 1.0985 1.0978
irintensity: 0.0662 1.1166 0.7325 0.2363 0.5316 1.0413 0.0724 0.4730 0.1640 0.2167 0.8423 0.3868 1.9128 0.8288 4.5920 1.8229 7.4598 4.0822 6.9147 3.0624 0.9641 0.1675 4.1359 10.2721 0.1066 0.0743 0.1957 1.7102 3.5640 1.9333 3.3647 1.7549 1.3473 1.3850 14.9501 10.9153 5.7540 30.2429 62.7030 29.4694 40.2254 101.6728 4.7364 35.2141 38.4349 15.3625 0.8877 0.6017 0.7051 0.1362 1.7813 6.3218 0.7629 0.0791 0.5294 1.5787 41.8046 0.6200 0.8845 0.2184 1.0482 1.0764 1.0995 0.0438 0.1788 0.4144 2.1574 10.1401 14.3537 3.9954 4.5225 13.5949 216.0378 1.2630 0.7498 7.3587 0.1067 0.0541 0.1244 6.0691 3.5619 5.4704 1.5851 36.1091 72.6952 181.0464 4.6891 4.2833 0.7974 1.1258 0.5836 0.6552 5.4021 38.8329 14.2276 12.9944 13.4733 14.9559 12.1074 8.8418 28.1506 19.0264 0.6596 0.7420 0.3057 1.5974 3.9532 2.4658 173.0050 38.1871 6.7632 24.3571 0.2604 1.8597 1.1501 3.5340 4.6891 9.4272 22.3519 5.3794 22.2417 30.9157 16.6385 18.4491 28.2973 15.1584 24.1915 15.3712 23.0689
temp: 298.150 k
press: 1.00000 atm
elementType: 16 8 8 6 6 6 6 6 6 6 6 6 6 6 6 6 6 6 6 6 6 6 6 6 6 1 1 1 1 1 1 1 1 1 1 1 1 1 1 1 1 1 1 1 1
symmnumber: 1
zpe: 930735.1 jmol-1
zpe.correction: 0.354498 hartree
zpe.thermalcorrener: 0.377766 hartree
zpe.thermalcorrenthalpy: 0.378711 hartree
zpe.thermalcorrgfe: 0.298656 hartree
zpe.sumelectzpe: -1397.075782 hartree
zpe.sumelectthermal: -1397.052514 hartree
zpe.sumelectthermalent: -1397.051570 hartree
zpe.sumelectthermalfe: -1397.131625 hartree
dipole: 0.1111 1.3517 0.1346
dipole: 1.3629
quadrupole: -135.2551 -143.2558 -146.8262
quadrupole: -0.6920 4.1225 3.2483
quadrupole: 6.5239 -1.4768 -5.0472 -0.6920 4.1225 3.2483
hfenergy: -1397.4302805 hartree
pointgroup: C01 [X(C22H20O2S1)]
dipole: 0.0383709 -0.5158832 -0.1411161 debye
polarizability: 286.1422906|-7.8210155|258.4872935|7.8149146|1.7975187|238.1633635 unknown
InChI: InChI=1S/C22H20O2S/c1-24-21(23)17-25-22(18-11-5-2-6-12-18,19-13-7-3-8-14-19)20-15-9-4-10-16-20/h2-16H,17H2,1H3
charge 0 multiplicity 1
45 atoms
S  -0.935559 -0.329435 1.433149
O  -4.384959 -0.755008 1.858828
O  -4.018014 0.916717 0.278393
C  0.433825 -0.024557 0.023708
C  0.271693 1.360735 -0.639829
C  1.730286 -0.052447 0.864445
C  0.312195 -1.180869 -0.982719
C  1.416974 1.960476 -1.232463
C  1.860881 0.869102 1.940265
C  0.118797 -0.94907 -2.368121
C  -0.972031 2.027961 -0.754146
C  2.822135 -0.906471 0.572372
C  0.375135 -2.529141 -0.528526
C  -2.452741 -0.99062 0.473661
C  1.321757 3.192719 -1.91417
C  3.033933 0.910692 2.72018
C  -0.000819 -2.030203 -3.274462
C  -1.067847 3.262876 -1.436854
C  4.004659 -0.856997 1.347117
C  0.260274 -3.605493 -1.42991
C  0.075354 3.852156 -2.021003
C  4.114508 0.044774 2.427924
C  0.071688 -3.361419 -2.812716
C  -3.670314 -0.162283 0.815941
C  -5.577658 -0.006201 2.325498
H  2.389814 1.463324 -1.152746
H  1.038786 1.560952 2.157266
H  0.065145 0.076251 -2.745232
H  -1.875355 1.610639 -0.300516
H  2.759565 -1.60683 -0.265753
H  0.493504 -2.722486 0.543619
H  -2.226913 -0.911385 -0.599844
H  -2.592656 -2.042232 0.759292
H  2.220393 3.637505 -2.356726
H  3.109039 1.622159 3.550135
H  -0.152624 -1.82531 -4.340175
H  -2.041765 3.760353 -1.504536
H  4.839395 -1.522968 1.100542
H  0.310967 -4.634109 -1.055333
H  -0.000937 4.811698 -2.544854
H  5.029537 0.079021 3.029783
H  -0.022969 -4.197622 -3.514445
H  -5.281777 0.995061 2.680828
H  -5.987262 -0.614511 3.143591
H  -6.305737 0.101296 1.504042
