program: Gaussian 09
title: 000262558
version: EM64L-G09RevD.01
frameworkgroup: C1[X(C10H11N3O7)]
method: RPBEPBE
basis: SDD
operation: Freq
keyword: #p
keyword: freq=noraman
keyword: PBEPBE/SDD
title: #p freq=noraman PBEPBE/SDD
converged: YES YES NO NO
title: Mulliken charges:
elementType: O O O O O O O N N N C C C C C C C C C C H H H H H H H H H H H
charge: -0.442102 -0.408145 -0.226964 -0.188352 -0.244196 -0.212489 -0.204073 -0.399383 0.024150 0.016231 -0.202815 -0.122216 0.340992 -0.680674 0.235178 0.213189 -0.279204 -0.506171 0.446996 -0.419160 0.266928 0.218938 0.393532 0.205099 0.252022 0.239089 0.284303 0.337555 0.292722 0.373871 0.395148
chargesum: 0.00000
title: Mulliken charges with hydrogens summed into heavy atoms:
elementType: O O O O O O O N N N C C C C C C C C C C
charge: -0.068231 -0.012997 -0.226964 -0.188352 -0.244196 -0.212489 -0.204073 -0.005850 0.024150 0.016231 0.064113 0.096722 0.340992 0.015536 0.235178 0.213189 0.005099 -0.168616 0.446996 -0.126437
polarizability: 2.62596204e+02 -9.32834775e+00 1.84567989e+02 4.21002055e+00 -1.33439723e+01 9.52867443e+01
1716.lowfreq: -13.2138 -6.1358 -3.3326 -0.0006 0.0005 0.0005 16.1858 37.1799 45.9682
frequency: 14.9972 37.1114 45.9528 58.9175 74.2614 84.1368 98.1673 116.0355 132.8920 163.1827 169.5131 191.2494 206.3037 246.5506 286.3295 319.5423 330.7177 334.3713 344.4640 382.3241 396.6685 439.1965 444.7462 503.2350 517.5739 555.4280 585.7753 593.7554 618.2615 637.4671 651.0335 654.7416 688.4486 706.8897 721.8860 731.0376 756.1105 811.1537 826.4259 849.4693 874.3351 882.1824 889.6431 940.0202 968.7284 992.6782 1011.0162 1042.9711 1053.1082 1066.4156 1100.0349 1109.7106 1125.0476 1150.7426 1172.9461 1214.7170 1231.5320 1248.8798 1258.9586 1266.8434 1303.4566 1325.8790 1347.0808 1351.9441 1364.3501 1378.7122 1385.2826 1400.2928 1448.9094 1459.8934 1466.4808 1477.1457 1518.9995 1574.7379 1627.3363 1644.5839 2965.2749 3000.3389 3048.2767 3099.0155 3111.7806 3175.3177 3187.4326 3193.2539 3277.4324 3473.5171 3495.4186
redmass: 7.7260 6.4798 7.9544 13.2821 10.7087 7.6699 4.2995 6.3194 5.9407 5.5935 8.0184 1.2380 3.9837 5.9450 6.0280 5.5554 7.5546 6.2912 6.5753 8.8026 7.1798 3.9169 3.2348 9.5780 3.5721 1.0837 3.6853 3.6572 2.8368 2.2601 5.6858 6.2764 5.3037 7.4010 5.1396 4.8690 12.5584 3.5003 1.8571 2.7508 1.3058 3.0763 5.7157 2.4992 1.4079 1.3405 2.0904 2.5505 2.1479 2.0156 2.2188 3.0817 2.5998 1.5918 6.9305 6.4607 1.3881 1.6718 1.1900 1.3829 1.7130 1.8789 4.2675 1.5180 5.0992 1.7640 2.9150 1.3421 3.7066 1.0879 2.6569 1.0518 4.0073 6.6123 7.0967 8.1726 1.0850 1.0369 1.0848 1.0998 1.0999 1.0885 1.0918 1.0966 1.0783 1.0653 1.0641
irintensity: 0.8343 0.3967 0.8132 0.3436 1.0040 1.0578 5.6946 2.9984 1.1617 1.5088 2.9046 0.8937 6.8728 1.9857 8.1764 2.5940 4.1116 3.9293 1.1112 0.4627 1.0884 1.0697 19.6773 3.3682 11.1453 281.7077 40.5514 25.5136 49.2997 76.2189 22.5050 23.5446 22.1688 10.5049 21.3569 3.2459 8.4304 12.4809 42.3008 22.6113 65.9802 30.2073 9.0812 26.9498 25.9182 0.9375 17.9936 81.7159 34.8927 140.8561 52.3213 9.6163 33.2787 51.7180 327.2600 457.4701 35.7351 65.4098 37.6013 32.4291 61.0402 75.9108 158.1564 10.5782 41.5808 61.2328 31.5457 33.7259 5.9301 8.5625 3.2357 10.4383 176.1797 116.4069 401.2454 215.5174 51.1135 11.4518 16.9953 21.4410 23.1504 1.0215 19.0110 2.8100 139.7779 47.1194 28.5198
temp: 298.150 k
press: 1.00000 atm
elementType: 8 8 8 8 8 8 8 7 7 7 6 6 6 6 6 6 6 6 6 6 1 1 1 1 1 1 1 1 1 1 1
symmnumber: 1
zpe: 574380.8 jmol-1
zpe.correction: 0.218770 hartree
zpe.thermalcorrener: 0.237650 hartree
zpe.thermalcorrenthalpy: 0.238594 hartree
zpe.thermalcorrgfe: 0.169349 hartree
zpe.sumelectzpe: -1076.847939 hartree
zpe.sumelectthermal: -1076.829059 hartree
zpe.sumelectthermalent: -1076.828115 hartree
zpe.sumelectthermalfe: -1076.897361 hartree
dipole: -6.3730 -6.0028 1.4187
dipole: 8.8692
quadrupole: -145.9103 -123.3715 -110.8546
quadrupole: 13.7678 -5.4425 6.7225
quadrupole: -19.1982 3.3406 15.8575 13.7678 -5.4425 6.7225
hfenergy: -1077.0667096 hartree
pointgroup: C01 [X(C10H11N3O7)]
dipole: -2.5581694 2.3005968 -0.5821675 debye
polarizability: 261.9593512|9.8752927|183.678124|-8.7302987|-17.1260044|96.813462 unknown
InChI: InChI=1S/C10H11N3O7/c1-5(14)9(10(15)16)11-7-3-2-6(12(17)18)4-8(7)13(19)20/h2-5,9,11,14-15H,1H3
charge 0 multiplicity 1
31 atoms
O  -4.057174 -1.137691 0.169227
O  -2.235784 2.80849 0.777327
O  -3.641405 1.232339 1.742716
O  1.470169 -3.247896 0.764905
O  -0.728924 -2.666277 0.701397
O  4.523167 2.020769 -0.685202
O  4.994666 -0.139215 -0.10394
N  -1.424096 -0.242053 -0.032712
N  0.541191 -2.377598 0.570789
N  4.166699 0.820873 -0.353394
C  -2.492097 0.695221 -0.394619
C  -3.749671 -0.121689 -0.842036
C  -0.077516 0.012854 -0.085355
C  -3.52905 -0.86104 -2.163449
C  0.913741 -1.009325 0.19076
C  -2.866754 1.569871 0.817778
C  0.426104 1.316992 -0.427308
C  2.295298 -0.743035 0.100664
C  2.724546 0.540255 -0.257462
C  1.790646 1.578482 -0.518362
H  -2.170001 1.357187 -1.216723
H  -4.591903 0.596173 -0.943137
H  -1.71454 -1.187666 0.28195
H  -3.314094 -0.154557 -2.985017
H  -4.439364 -1.428659 -2.416409
H  -2.6949 -1.578071 -2.079132
H  -0.280698 2.134108 -0.584471
H  3.015372 -1.538654 0.308639
H  2.162963 2.573256 -0.776899
H  -4.289638 -0.672446 1.01964
H  -2.468554 3.349102 1.582132
