program: Gaussian 09
title: 000262548
version: EM64L-G09RevD.01
frameworkgroup: C1[X(C11H19N3O)]
method: RPBEPBE
basis: SDD
operation: Freq
keyword: #p
keyword: freq=noraman
keyword: PBEPBE/SDD
title: #p freq=noraman PBEPBE/SDD
converged: NO YES NO NO
title: Mulliken charges:
elementType: O N N N C C C C C C C C C C C H H H H H H H H H H H H H H H H H H H
charge: -0.254876 0.048252 -0.404270 -0.654048 -0.157460 0.367619 -0.232967 -0.505481 -0.486422 -0.472996 -0.588737 0.102950 -0.754597 -0.766429 0.292208 0.224065 0.268200 0.245503 0.211927 0.226690 0.203872 0.218853 0.232136 0.241035 0.188543 0.207337 0.217742 0.219469 0.220517 0.207274 0.233973 0.262647 0.341397 0.296074
chargesum: 0.00000
title: Mulliken charges with hydrogens summed into heavy atoms:
elementType: O N N N C C C C C C C C C C C
charge: -0.254876 0.048252 -0.141623 -0.016577 0.066605 0.367619 0.035233 -0.048051 -0.055860 -0.022008 -0.159158 0.102950 -0.110049 -0.104666 0.292208
polarizability: 1.92367024e+02 -5.20366440e+00 1.35596504e+02 -2.57444840e+00 -7.31018133e+00 1.08710798e+02
1716.lowfreq: -31.3754 -10.8279 -0.0008 0.0003 0.0004 3.9134 28.0235 41.0183 82.9467
frequency: 26.7486 40.1638 82.4200 114.3251 125.3260 189.2060 195.9072 218.9129 237.7115 243.7643 250.5525 297.1468 324.0771 354.3981 371.7768 385.8446 425.2199 443.7460 460.5083 473.4058 485.8052 528.2990 538.0945 580.8367 623.8966 666.6710 709.8732 734.4467 776.5082 780.7114 834.9058 864.5797 881.2184 901.4072 910.6344 931.1806 937.1726 943.7809 955.8947 966.1616 987.9361 1004.2287 1038.0512 1047.1639 1062.6743 1088.2697 1099.1697 1129.3342 1137.1980 1160.8023 1178.2942 1196.9229 1210.6596 1246.1605 1261.5105 1263.2195 1279.7415 1284.6158 1295.7840 1297.7829 1302.5531 1320.9090 1341.4284 1378.4197 1396.8358 1446.7545 1462.4882 1467.1197 1469.0779 1478.2758 1481.2325 1483.1026 1491.4146 1501.0282 1600.5481 1609.4631 1680.3780 2953.4292 2968.5633 2972.8251 2992.7606 2998.6263 3000.6844 3006.2157 3020.0631 3048.9518 3057.3427 3063.3662 3068.1862 3071.4880 3075.3616 3076.6701 3084.8367 3412.1274 3537.6043 3697.2574
redmass: 4.6374 3.4306 3.8921 4.5775 2.7243 2.1140 1.1740 3.9872 1.1885 2.2594 1.3493 2.7922 2.0823 2.7143 2.7200 2.8468 2.0222 2.2499 3.2173 1.2954 2.6268 1.6568 2.9873 3.0382 4.2858 3.5275 8.6492 4.6210 2.9565 1.4007 3.0804 2.6690 2.5678 2.5679 2.1009 2.0946 1.5076 2.4127 2.0939 1.7328 1.5939 1.5365 2.2237 1.5530 2.1591 3.1056 1.4373 1.3790 1.4804 1.6873 2.2851 1.4912 1.5053 1.5364 1.8976 1.8981 1.3769 1.8008 1.6855 1.7128 1.4792 1.8845 1.6632 1.2030 1.2034 1.0941 1.0615 1.0658 1.0647 1.0688 1.1627 1.5501 1.0953 1.0797 1.3250 5.5460 5.4705 1.0583 1.0357 1.0368 1.0716 1.0617 1.0998 1.0692 1.0725 1.1028 1.0994 1.0984 1.0951 1.0956 1.1000 1.0994 1.0970 1.0745 1.0459 1.1034
irintensity: 15.9055 2.9340 5.6808 1.7295 2.9103 0.1787 0.0587 1.1362 0.4733 0.8879 12.0010 1.5874 0.9991 5.0498 3.2840 72.1898 13.6098 48.7502 2.2043 170.3603 7.0203 50.2453 20.6135 30.3399 9.6730 0.7385 17.9254 1.0733 4.3651 1.9720 0.4276 1.8951 2.5246 2.6553 2.5781 5.5814 1.4729 2.9634 4.4588 0.4179 8.1383 3.6343 21.5419 10.5076 6.0259 139.1841 14.9644 7.6599 16.7085 22.8669 8.0217 3.6822 5.6656 25.5698 40.7170 21.8985 6.0964 63.8698 171.1584 39.2754 6.4614 34.2846 2.8327 18.4516 18.7356 4.2778 0.5503 5.8874 3.5872 7.7445 92.3089 384.2864 12.0398 1.9243 138.4475 5.9816 335.5815 24.3838 28.3141 35.1198 10.2206 29.4177 43.5804 70.7217 71.3098 1.7417 3.0436 60.8624 12.2211 30.2917 48.6358 69.3105 29.5864 21.4448 40.1781 41.5188
temp: 298.150 k
press: 1.00000 atm
elementType: 8 7 7 7 6 6 6 6 6 6 6 6 6 6 6 1 1 1 1 1 1 1 1 1 1 1 1 1 1 1 1 1 1 1
symmnumber: 1
zpe: 766209.0 jmol-1
zpe.correction: 0.291834 hartree
zpe.thermalcorrener: 0.307121 hartree
zpe.thermalcorrenthalpy: 0.308065 hartree
zpe.thermalcorrgfe: 0.249504 hartree
zpe.sumelectzpe: -668.862600 hartree
zpe.sumelectthermal: -668.847313 hartree
zpe.sumelectthermalent: -668.846369 hartree
zpe.sumelectthermalfe: -668.904930 hartree
dipole: 3.1078 4.8780 -2.6144
dipole: 6.3473
quadrupole: -92.7849 -89.6884 -91.6156
quadrupole: -20.0237 10.1151 -1.3384
quadrupole: -1.4220 1.6746 -0.2526 -20.0237 10.1151 -1.3384
hfenergy: -669.1544339 hartree
pointgroup: C01 [X(C11H19N3O1)]
dipole: -1.13841 -1.9531869 -1.0607785 debye
polarizability: 192.8351283|-1.3726908|134.5854152|-0.9523809|8.4622251|109.2537829 unknown
InChI: InChI=1S/C11H19N3O/c1-11(2)6-9(13-14-10(12)15)7-3-4-8(11)5-7/h7-8,14H,3-6,12H2,1-2H3
charge 0 multiplicity 1
34 atoms
O  4.178701 1.198385 0.437365
N  1.410208 0.777084 0.052582
N  2.382308 -0.12573 -0.363503
N  4.597212 -0.794763 -0.699702
C  -2.6150 -0.112403 0.485185
C  -1.700613 -1.32499 0.083274
C  -0.868622 1.521796 0.342903
C  -1.836266 0.886018 1.383048
C  -2.995149 0.800095 -0.729817
C  -1.860218 1.882135 -0.813317
C  -0.45615 -0.794362 -0.715741
C  0.138617 0.473371 -0.105249
C  -2.485816 -2.329299 -0.79923
C  -1.20762 -2.083702 1.347294
C  3.747689 0.180222 -0.160148
H  -3.516284 -0.514478 0.986962
H  -0.317151 2.396108 0.724378
H  -1.317842 0.427187 2.240322
H  -2.520918 1.661557 1.778575
H  -3.97348 1.279024 -0.541714
H  -3.098409 0.232405 -1.671455
H  -1.3586 1.901321 -1.797417
H  -2.268262 2.893852 -0.637251
H  -0.771607 -0.565932 -1.755415
H  0.277436 -1.623338 -0.791123
H  -1.827962 -3.152807 -1.137423
H  -3.319425 -2.779417 -0.227751
H  -2.913153 -1.851246 -1.699034
H  -2.051518 -2.312528 2.024914
H  -0.738257 -3.043974 1.060103
H  -0.459383 -1.507535 1.919138
H  2.12609 -1.018481 -0.803888
H  5.594473 -0.644292 -0.572756
H  4.284072 -1.589482 -1.253308
