program: Gaussian 09
title: 000262555
version: EM64L-G09RevD.01
frameworkgroup: C1[X(C9H9N3O7)]
method: RPBEPBE
basis: SDD
operation: Freq
keyword: #pfreq=noraman
keyword: PBEPBE/SDD
title: #p freq=noraman PBEPBE/SDD
converged: YES YES NO NO
title: Mulliken charges:
elementType: O O O O O O O N N N C C C C C C C C C H H H H H H H H H
charge: -0.443025 -0.410307 -0.224400 -0.187501 -0.251002 -0.213320 -0.204469 -0.334115 0.024916 0.016570 -0.443440 0.342184 -0.113731 0.249548 -0.284539 -0.502229 0.446464 -0.416830 0.141229 0.261021 0.247270 0.362704 0.272782 0.260510 0.337477 0.292812 0.373247 0.400173
chargesum: 0.00000
title: Mulliken charges with hydrogens summed into heavy atoms:
elementType: O O O O O O O N N N C C C C C C C C C
charge: -0.069778 -0.010134 -0.224400 -0.187501 -0.251002 -0.213320 -0.204469 0.028589 0.024916 0.016570 0.064851 0.342184 0.159051 0.249548 -0.024029 -0.164752 0.446464 -0.124018 0.141229
polarizability: 2.52300405e+02 1.50647298e+01 1.89003728e+02 -1.64658176e+01 6.30859898e+00 7.24058167e+01
1716.lowfreq: -6.6957 -2.2806 0.0009 0.0009 0.0010 4.0117 24.5353 31.5968 37.6325
frequency: 24.3950 31.5679 37.6014 52.8672 57.7491 73.4850 102.5533 144.4023 160.4296 165.6302 225.4910 244.0744 271.7097 301.1064 317.4160 331.4800 350.8432 383.6190 408.3310 436.6824 449.7801 499.7507 511.7111 522.0458 568.5508 608.0858 622.1634 631.1568 653.6898 665.0814 683.9849 706.1860 728.6280 754.9187 767.5806 793.7815 830.4041 854.3929 884.4034 913.5497 969.4415 994.4917 1013.5294 1033.6678 1049.2939 1090.6542 1094.1842 1113.7369 1154.2395 1172.9711 1212.9072 1217.5795 1242.3318 1261.4461 1281.3480 1309.1318 1317.2027 1344.1869 1348.6220 1363.6293 1378.2373 1390.6720 1450.0812 1479.0347 1491.5122 1532.4368 1585.0336 1629.3823 1650.5188 3008.3501 3027.8489 3093.9697 3168.0254 3187.0994 3188.5931 3330.8649 3483.1836 3518.8197
redmass: 8.0612 7.8992 7.9882 11.3425 13.7348 11.1285 7.9016 8.0941 9.0898 5.7750 6.2760 4.1782 6.4249 2.1659 3.2965 3.6705 5.3161 9.7078 3.7839 3.8895 4.4280 3.6900 5.7070 3.9967 1.9249 4.6262 2.3818 5.2036 7.0702 5.1572 3.9928 7.5507 4.0642 11.8814 4.6178 1.3019 1.4582 3.7676 7.5787 2.8009 1.4086 1.3270 4.6753 3.1646 2.3765 2.4345 2.6352 4.4979 1.4031 9.0920 3.0962 1.4050 1.5538 1.4335 1.6640 2.0815 1.3812 2.4306 1.8369 4.4821 1.7956 2.8075 4.7613 1.3475 1.9292 3.7048 4.1068 7.0268 9.2177 1.0830 1.0597 1.1056 1.0879 1.0932 1.0955 1.0790 1.0655 1.0645
irintensity: 0.8075 1.3015 0.3333 4.1051 1.2301 0.5550 1.6029 1.3091 2.9227 2.9460 7.4174 1.4623 10.1303 68.6111 23.4796 20.3809 8.8511 0.5914 23.1979 3.0307 10.6038 3.1305 6.3339 15.1125 57.5636 8.6996 63.9188 10.4276 20.0193 58.9743 28.5379 9.9599 0.0689 11.5185 8.2097 91.2666 18.1694 50.7075 12.1942 16.0198 24.9374 0.1740 126.1536 173.5185 18.0138 23.6878 54.7379 29.3981 58.2779 444.3376 366.8445 47.1859 56.8520 12.9300 76.0325 98.6162 2.7474 173.7669 48.7656 55.5987 68.9053 11.7512 5.3066 21.2227 26.3231 83.3498 128.6549 429.2447 232.6951 12.3843 26.0463 8.8086 2.9179 8.0561 16.8232 123.0406 56.9700 46.0521
temp: 298.150 k
press: 1.00000 atm
elementType: 8 8 8 8 8 8 8 7 7 7 6 6 6 6 6 6 6 6 6 1 1 1 1 1 1 1 1 1
symmnumber: 1
zpe: 502129.7 jmol-1
zpe.correction: 0.191251 hartree
zpe.thermalcorrener: 0.208792 hartree
zpe.thermalcorrenthalpy: 0.209736 hartree
zpe.thermalcorrgfe: 0.142963 hartree
zpe.sumelectzpe: -1037.619024 hartree
zpe.sumelectthermal: -1037.601483 hartree
zpe.sumelectthermalent: -1037.600539 hartree
zpe.sumelectthermalfe: -1037.667312 hartree
dipole: 7.9798 -3.7274 -2.6699
dipole: 9.2032
quadrupole: -130.1486 -122.3934 -107.6539
quadrupole: -14.8943 -4.2670 0.7006
quadrupole: -10.0833 -2.3281 12.4114 -14.8943 -4.2670 0.7006
hfenergy: -1037.8102748 hartree
pointgroup: C01 [X(C9H9N3O7)]
dipole: 3.0110138 -1.9087323 -0.6332387 debye
polarizability: 251.0645978|3.453481|179.6788811|-28.9673549|-29.93998|82.9664702 unknown
InChI: InChI=1S/C9H9N3O7/c13-8(9(14)15)4-10-6-2-1-5(11(16)17)3-7(6)12(18)19/h1-3,8,10,13-14H,4H2
charge 0 multiplicity 1
28 atoms
O  3.579145 1.148132 0.717248
O  3.878524 -2.481384 0.220745
O  5.493468 -0.82406 0.519998
O  -2.237423 3.160944 -0.741761
O  -0.02359 2.930017 -1.2116
O  -3.98748 -2.473891 1.356967
O  -4.899331 -0.406949 1.006725
N  1.148341 0.605626 -0.889593
N  -1.168265 2.445905 -0.793193
N  -3.908693 -1.236279 0.983251
C  2.362457 -0.201968 -0.944301
C  -0.065749 0.171437 -0.427532
C  3.121191 -0.196226 0.422506
C  -1.226304 1.041963 -0.372255
C  -0.26158 -1.184423 0.017538
C  -2.476094 0.579684 0.087819
C  -2.60525 -0.751299 0.501924
C  -1.497254 -1.640537 0.468196
C  4.296868 -1.169507 0.401276
H  3.028621 0.239714 -1.704924
H  2.134955 -1.238744 -1.245066
H  1.192853 1.614562 -1.110725
H  2.421716 -0.515424 1.219355
H  0.581293 -1.879768 0.006416
H  -3.330443 1.260853 0.116002
H  -1.636127 -2.671785 0.80348
H  4.575093 1.146402 0.744247
H  4.656053 -3.103094 0.220056
