program: Gaussian 09
title: 000262559
version: EM64L-G09RevD.01
frameworkgroup: C1[X(C10H11N3O7)]
method: RPBEPBE
basis: SDD
operation: Freq
keyword: #p
keyword: freq=noraman
keyword: PBEPBE/SDD
title: #p freq=noraman PBEPBE/SDD
converged: YES YES NO NO
title: Mulliken charges:
elementType: O O O O O O O N N N C C C C C C C C C C H H H H H H H H H H H
charge: -0.427498 -0.406037 -0.235961 -0.188387 -0.239803 -0.213095 -0.204234 -0.434652 0.024910 0.015430 0.147198 -0.398543 -0.689459 0.350041 0.190480 0.224067 -0.279127 -0.507987 -0.447226 0.453201 0.405295 0.247499 0.213585 0.249234 0.235389 0.231384 0.282357 0.337776 0.292244 0.376567 0.395353
chargesum: 0.00000
title: Mulliken charges with hydrogens summed into heavy atoms:
elementType: O O O O O O O N N N C C C C C C C C C C
charge: -0.050930 -0.010683 -0.235961 -0.188387 -0.239803 -0.213095 -0.204234 -0.029357 0.024910 0.015430 0.147198 0.062541 0.026548 0.350041 0.190480 0.224067 0.003230 -0.170211 -0.154982 0.453201
polarizability: 2.52372861e+02 1.00317817e+01 1.92486415e+02 6.54850763e+00 -4.63080535e+00 9.23951954e+01
1716.lowfreq: 0.0007 0.0010 0.0012 4.4090 8.0705 10.0423 19.7106 41.3573 51.3317
frequency: 19.5845 41.3493 51.3312 62.1930 74.3152 89.7715 120.7074 141.6998 161.0043 168.6091 180.3767 189.1343 207.3261 247.0126 286.8478 306.0016 319.1149 345.1093 371.0690 383.9393 387.8055 419.2368 447.9084 503.6737 518.5017 528.7006 565.8229 574.4914 598.6896 631.2228 653.2788 660.0363 673.5144 707.5873 711.0515 732.6652 740.4599 756.0918 798.6686 811.7411 847.9967 872.5231 895.2795 939.1150 968.4079 984.3346 1002.0142 1017.5438 1041.7412 1053.7653 1107.9125 1124.6298 1140.8507 1149.2995 1168.6928 1176.9545 1210.5098 1230.8564 1265.6404 1297.5873 1314.5324 1324.7500 1346.8508 1364.8651 1380.6980 1383.3440 1406.8486 1451.2476 1457.9865 1471.6667 1478.1765 1486.7392 1521.7831 1579.8651 1626.5711 1627.7919 2977.3817 3008.8633 3083.7004 3099.9318 3134.5399 3176.6840 3187.6928 3199.2823 3242.6451 3473.6498 3492.2395
redmass: 8.6023 8.1804 7.8874 11.4178 11.2956 7.7332 6.8207 3.9954 2.1593 7.5416 3.7903 2.0760 5.2183 2.6615 6.1666 4.4006 5.9819 6.8183 5.6439 7.8248 5.1409 5.6003 4.1854 8.9996 3.2371 2.2791 1.9702 2.5910 4.1161 2.1150 3.6060 6.2511 5.0653 6.9348 4.3241 4.0661 4.7996 11.2196 2.1830 1.7523 1.4566 5.0398 2.2959 2.8099 1.4125 1.5405 1.3265 4.2279 2.7693 2.2440 3.4767 1.7214 2.0766 2.6135 1.8901 7.2330 2.8101 2.2513 1.7256 2.3502 2.6464 1.3016 4.4013 4.7263 4.2666 1.2470 1.1966 4.2044 1.0850 1.1054 1.0634 2.4445 3.0530 4.9468 7.7995 7.6533 1.0660 1.0383 1.0988 1.1003 1.0970 1.0898 1.0918 1.0951 1.0783 1.0652 1.0640
irintensity: 0.8180 0.0871 0.2549 0.6577 0.6024 1.2748 5.1868 5.1680 0.9187 8.8517 4.3833 1.0321 2.1527 1.5466 2.0391 1.7894 0.0958 3.2516 4.8996 0.6762 2.9236 0.5439 0.4092 9.6419 43.4882 94.8634 97.9428 96.0210 19.4826 48.2045 76.1912 30.0888 87.4407 10.7053 0.1544 6.8816 8.7607 7.0711 44.2533 43.0752 33.7274 2.4387 16.4836 15.1642 24.5138 26.2484 1.7562 93.6411 216.5257 9.4602 52.1649 2.0727 18.7073 53.6983 38.9870 377.8026 454.8044 38.9861 40.5569 23.5741 117.4720 14.5606 168.9158 49.3776 51.7703 23.0021 31.5110 16.7518 6.8369 9.2238 15.6137 27.9754 167.8641 129.4268 392.1889 143.4867 55.0751 17.7948 9.2543 24.4614 12.4039 2.4610 19.6763 0.4790 150.5932 46.9355 33.4765
temp: 298.150 k
press: 1.00000 atm
elementType: 8 8 8 8 8 8 8 7 7 7 6 6 6 6 6 6 6 6 6 6 1 1 1 1 1 1 1 1 1 1 1
symmnumber: 1
zpe: 574109.6 jmol-1
zpe.correction: 0.218667 hartree
zpe.thermalcorrener: 0.237455 hartree
zpe.thermalcorrenthalpy: 0.238400 hartree
zpe.thermalcorrgfe: 0.170222 hartree
zpe.sumelectzpe: -1076.839911 hartree
zpe.sumelectthermal: -1076.821123 hartree
zpe.sumelectthermalent: -1076.820178 hartree
zpe.sumelectthermalfe: -1076.888356 hartree
dipole: 7.2005 -5.9359 1.6798
dipole: 9.4818
quadrupole: -139.7435 -127.2049 -111.9705
quadrupole: -15.8058 3.9910 3.7684
quadrupole: -13.4372 -0.8986 14.3358 -15.8058 3.9910 3.7684
hfenergy: -1077.0585782 hartree
pointgroup: C01 [X(C10H11N3O7)]
dipole: -2.7890247 2.1516978 1.2278478 debye
polarizability: 250.8071933|13.1551817|188.3474015|-14.8354216|20.2608761|98.0998764 unknown
InChI: InChI=1S/C10H11N3O7/c1-10(5-14,9(15)16)11-7-3-2-6(12(17)18)4-8(7)13(19)20/h2-4,11,14-15H,5H2,1H3
charge 0 multiplicity 1
31 atoms
O  -3.820858 -1.460739 -0.589873
O  -2.528563 2.664461 0.130533
O  -3.258137 1.178753 -1.485173
O  1.657109 -3.359098 -0.816071
O  -0.566355 -2.924926 -0.607614
O  4.427382 2.190632 -0.019889
O  4.986437 0.055192 -0.614269
N  -1.354449 -0.557579 0.209832
N  0.686168 -2.54504 -0.586486
N  4.126442 0.955993 -0.269949
C  -2.492173 0.258485 0.689161
C  -3.7431 -0.69849 0.641268
C  -2.325731 0.762954 2.138726
C  -0.03898 -0.18569 0.088642
C  -2.792394 1.382298 -0.338588
C  0.988997 -1.137077 -0.296146
C  0.405731 1.162779 0.328504
C  2.343632 -0.763536 -0.408079
C  1.743246 1.531908 0.213057
C  2.713469 0.561437 -0.150981
H  -1.585406 -1.507684 -0.144516
H  -3.640003 -1.446338 1.44509
H  -4.65652 -0.095939 0.824875
H  -1.505248 1.484772 2.256432
H  -2.126887 -0.10117 2.795819
H  -3.252545 1.25826 2.477154
H  -0.327486 1.929134 0.583531
H  3.089917 -1.509388 -0.693413
H  2.064924 2.561532 0.390692
H  -3.893521 -0.82367 -1.353042
H  -2.757697 3.337477 -0.568827
