program: Gaussian 09
title: 000262566
version: EM64L-G09RevD.01
frameworkgroup: C1[X(C12H13N3O6)]
method: RPBEPBE
basis: SDD
operation: Freq
keyword: #p
keyword: freq=noraman
keyword: PBEPBE/SDD
title: #p freq=noraman PBEPBE/SDD
converged: NO YES NO NO
title: Mulliken charges:
elementType: O O O O O O N N N C C C C C C C C C C C C H H H H H H H H H H H H H
charge: -0.400392 -0.208788 -0.188225 -0.260443 -0.212504 -0.206318 -0.413451 0.024409 0.015561 0.291870 -0.542745 -0.492998 -0.433057 -0.438037 0.085199 0.330291 0.230234 -0.243552 -0.507622 -0.453306 0.450976 0.254410 0.238424 0.260247 0.238651 0.224734 0.242153 0.226244 0.229945 0.357301 0.276620 0.392525 0.337162 0.294481
chargesum: 0.00000
title: Mulliken charges with hydrogens summed into heavy atoms:
elementType: O O O O O O N N N C C C C C C C C C C C C
charge: -0.007868 -0.208788 -0.188225 -0.260443 -0.212504 -0.206318 -0.056150 0.024409 0.015561 0.291870 -0.049911 0.005900 0.033831 0.018152 0.085199 0.330291 0.230234 0.033068 -0.170460 -0.158825 0.450976
polarizability: 2.71725545e+02 -9.11544992e+00 2.02993056e+02 3.40349673e-01 1.02550874e+01 1.09361139e+02
1716.lowfreq: -6.5498 -0.0007 -0.0005 -0.0004 3.2134 7.2776 28.9437 34.3843 38.3986
frequency: 28.8370 34.3201 38.3759 54.1359 59.0263 78.5414 85.8223 117.1278 157.0396 169.2132 172.3929 196.8466 235.5665 260.8664 298.3886 313.0112 330.6567 369.2950 375.2991 406.1791 434.6320 458.9585 498.7335 520.5061 529.5114 566.5103 594.5483 605.6513 625.5291 653.6236 663.3944 668.2837 705.8729 705.9974 724.5985 734.0214 755.3794 779.8457 805.3770 824.4673 832.9448 861.5132 876.8120 906.0351 911.5821 947.5989 967.7363 983.8488 996.3739 1027.7952 1040.8298 1053.5095 1055.2416 1075.1906 1104.3752 1115.8436 1151.5006 1167.2533 1172.3387 1202.3963 1218.8559 1231.2387 1245.9176 1256.2337 1292.9564 1302.2010 1308.1116 1311.5133 1319.9138 1326.7052 1344.6627 1362.5881 1380.6516 1451.9067 1462.9392 1467.0972 1472.8482 1483.3876 1494.0992 1524.6193 1583.2254 1627.2311 1645.3925 3004.3538 3005.3327 3011.0236 3025.9388 3068.9219 3073.5149 3084.0922 3096.3252 3170.2615 3187.2727 3188.8329 3294.6717 3512.5683
redmass: 3.9252 5.6488 11.2923 4.9889 14.3007 9.7047 6.1216 7.0797 3.6509 5.1066 5.7888 4.3820 3.0501 4.8158 4.2113 5.2733 5.9949 8.3449 5.5880 5.2912 4.0198 5.3500 7.7864 3.4916 3.1207 2.5128 1.8048 2.5138 5.1226 6.9149 4.1968 8.3793 5.4135 3.9854 3.1687 3.7758 9.4474 1.2898 4.1588 1.9289 1.4522 1.9858 3.5600 2.4842 2.6878 2.4532 1.4079 2.7647 1.3245 1.9259 2.7135 1.9612 2.0982 1.7600 3.1466 3.5937 1.4176 6.4792 1.7831 2.1633 2.8303 1.4088 1.6254 1.6261 1.3145 1.7409 1.3564 2.2554 1.4504 1.6283 3.9828 5.1949 4.7605 4.5657 1.0957 1.1891 1.0945 1.1407 2.2861 3.3393 3.8656 7.1487 9.4833 1.0626 1.0634 1.0618 1.0620 1.0987 1.1027 1.1050 1.1050 1.0881 1.0934 1.0955 1.0789 1.0643
irintensity: 0.6274 0.1863 1.6383 0.5291 0.1918 1.1826 0.3705 1.1604 2.4786 2.0896 1.8969 1.6812 0.2629 3.4696 0.0441 0.8962 1.7757 2.4180 5.4347 2.1068 2.6890 3.1589 8.1041 9.0494 1.1092 9.7557 60.9500 61.2069 7.1420 16.4434 55.2379 12.2947 10.0576 13.6435 2.3875 13.7105 11.0438 76.7609 2.4452 5.5718 18.8019 5.3125 6.2991 9.5878 15.3574 44.5597 23.8358 19.0735 1.1087 19.6568 33.5856 20.9501 89.1388 19.5065 50.4915 20.2080 10.2420 359.5134 53.7625 290.9125 192.0092 16.6370 27.3198 23.4076 1.0326 39.1364 23.0905 95.5264 2.8549 10.2005 184.0858 48.1498 46.7281 4.5504 5.3660 14.3371 10.0700 5.1720 72.3740 85.5924 117.4689 380.3241 183.4700 21.8087 37.4704 15.7787 13.6608 22.3196 14.2159 27.1592 37.6363 1.8123 7.8296 16.5478 93.1381 40.3730
temp: 298.150 k
press: 1.00000 atm
elementType: 8 8 8 8 8 8 7 7 7 6 6 6 6 6 6 6 6 6 6 6 6 1 1 1 1 1 1 1 1 1 1 1 1 1
symmnumber: 1
zpe: 657494.6 jmol-1
zpe.correction: 0.250426 hartree
zpe.thermalcorrener: 0.269209 hartree
zpe.thermalcorrenthalpy: 0.270153 hartree
zpe.thermalcorrgfe: 0.201256 hartree
zpe.sumelectzpe: -1078.981428 hartree
zpe.sumelectthermal: -1078.962646 hartree
zpe.sumelectthermalent: -1078.961701 hartree
zpe.sumelectthermalfe: -1079.030598 hartree
dipole: -7.7844 -1.5761 -0.0135
dipole: 7.9423
quadrupole: -144.3536 -142.4965 -112.4535
quadrupole: -1.5479 3.0687 -4.3813
quadrupole: -11.2524 -9.3953 20.6477 -1.5479 3.0687 -4.3813
hfenergy: -1079.2318545 hartree
pointgroup: C01 [X(C12H13N3O6)]
dipole: -3.0133477 -0.7451108 0.3586327 debye
polarizability: 271.7298802|-6.4448805|202.6902227|-10.5837466|-7.8982598|109.6596368 unknown
InChI: InChI=1S/C12H13N3O6/c16-11(17)12(5-1-2-6-12)13-9-4-3-8(14(18)19)7-10(9)15(20)21/h3-4,7,13,16H,1-2,5-6H2
charge 0 multiplicity 1
34 atoms
O  -1.695511 -0.418073 2.591234
O  -2.648565 -2.370113 1.777637
O  1.710313 3.457052 -0.492776
O  -0.4989 3.003982 -0.193954
O  4.482171 -2.158338 -0.433869
O  5.057479 0.044139 -0.64411
N  -1.300172 0.525696 0.053863
N  0.750805 2.616243 -0.320875
N  4.187352 -0.898094 -0.4832
C  -2.428164 -0.40231 0.270825
C  -3.738318 0.460686 0.382173
C  -2.685643 -1.341509 -0.966038
C  -4.237111 0.569994 -1.076559
C  -4.021183 -0.865847 -1.614213
C  -2.264466 -1.196683 1.584845
C  0.015587 0.183785 -0.080144
C  1.051971 1.184754 -0.265977
C  0.451825 -1.188761 -0.038712
C  2.410273 0.827701 -0.396383
C  1.791871 -1.538692 -0.166381
C  2.77117 -0.523368 -0.347694
H  -3.549411 1.424508 0.886227
H  -4.483164 -0.092612 0.983333
H  -2.741323 -2.395239 -0.645739
H  -1.848847 -1.242325 -1.678009
H  -3.626333 1.297568 -1.64387
H  -5.289333 0.897686 -1.132444
H  -4.854279 -1.514193 -1.284647
H  -3.984039 -0.907663 -2.716123
H  -1.475551 1.546175 0.054146
H  -0.287575 -1.980509 0.101092
H  -1.648407 -0.943184 3.436118
H  3.166499 1.604998 -0.532393
H  2.113182 -2.582953 -0.129384
