program: Gaussian 09
title: 000262571
version: EM64L-G09RevD.01
frameworkgroup: C1[X(C13H17N3O6)]
method: RPBEPBE
basis: SDD
operation: Freq
keyword: #p
keyword: freq=noraman
keyword: PBEPBE/SDD
title: #p freq=noraman PBEPBE/SDD
converged: YES YES NO NO
title: Mulliken charges:
elementType: O O O O O O N N N C C C C C C C C C C C C C H H H H H H H H H H H H H H H H H
charge: -0.414516 -0.212821 -0.192117 -0.241635 -0.216427 -0.206975 -0.473116 0.020819 0.014919 0.234241 -0.421374 -0.037024 -0.702886 -0.694950 -0.710319 0.098537 0.367688 0.214515 -0.259367 -0.526279 -0.451425 0.452058 0.236970 0.205812 0.196743 0.228440 0.241239 0.254413 0.400913 0.217324 0.223213 0.219724 0.214474 0.232823 0.222407 0.238048 0.337498 0.397135 0.291280
chargesum: 0.00000
title: Mulliken charges with hydrogens summed into heavy atoms:
elementType: O O O O O O N N N C C C C C C C C C C C C C
charge: -0.017381 -0.212821 -0.192117 -0.241635 -0.216427 -0.206975 -0.072203 0.020819 0.014919 0.234241 0.021407 0.159719 0.021207 -0.034689 -0.040615 0.098537 0.367688 0.214515 -0.021320 -0.188781 -0.160145 0.452058
polarizability: 2.94801002e+02 8.91242847e+00 2.05047149e+02 -1.21856671e+01 1.43672385e+01 1.21625732e+02
1716.lowfreq: -9.9789 -3.5278 -0.0009 -0.0008 -0.0004 9.1532 23.5115 28.4967 34.0544
frequency: 23.3433 28.3436 33.9624 58.8436 69.1740 87.4713 91.0356 108.6960 134.9346 153.8569 161.8449 169.5148 181.0494 197.8444 213.9434 242.0088 265.0109 288.7404 294.9581 299.9438 316.6094 324.7694 367.4543 372.3475 380.8840 404.5596 407.1163 450.7453 494.1681 503.2309 520.5046 539.4415 557.4073 606.8301 613.1752 649.5717 655.6757 668.4136 706.2377 719.4846 732.0699 735.8814 756.2278 773.3601 797.9769 819.9198 853.7972 884.2708 890.2844 910.8445 923.7899 942.9657 963.3346 971.3993 990.7163 993.2255 1038.8331 1052.4685 1066.1164 1080.2184 1101.4436 1111.2424 1145.2588 1163.3205 1170.1608 1184.3779 1205.8090 1218.6685 1247.5284 1274.4725 1293.6843 1309.6802 1325.0484 1340.2590 1345.2895 1360.3936 1363.2791 1379.8723 1383.7458 1392.2426 1403.2982 1450.0285 1453.5967 1467.3979 1470.3614 1477.3551 1482.5899 1486.6003 1492.6169 1497.2270 1531.5594 1578.8434 1628.7277 1653.4486 2952.5038 2978.2397 2981.5062 3002.6799 3009.9428 3054.5402 3069.6906 3073.7161 3078.1030 3086.4651 3109.0372 3124.8348 3176.8282 3179.7141 3187.0702 3211.4148 3525.1496
redmass: 3.1948 5.6452 5.7022 12.8354 11.5339 6.3345 9.3678 4.1565 3.5607 3.0155 3.5351 2.5317 2.9782 4.5558 3.3762 4.1309 1.1329 1.1317 2.8711 4.4848 4.1259 8.2997 3.8282 3.6418 2.0585 6.3609 3.5112 3.9970 6.2638 6.0216 3.5274 3.9382 2.1102 2.5493 2.2339 5.6902 7.0235 10.0904 7.8580 4.1302 4.3589 4.4565 10.1277 3.4057 3.8184 1.5960 2.7313 1.4778 2.2203 1.5641 1.3678 2.1598 1.5211 1.4067 1.5504 1.5605 2.9361 2.3325 2.4254 1.7098 1.8952 3.7958 1.6709 3.4427 2.4081 2.8563 2.1488 5.9106 1.7168 1.3065 1.8703 1.6177 2.1508 1.7615 4.0057 1.6209 2.8636 3.5274 1.2130 1.2346 1.2350 2.8384 1.2797 1.0456 1.0573 1.1654 1.1047 1.0628 1.9962 1.0616 3.5507 4.5363 7.3687 7.9546 1.0824 1.0354 1.0365 1.0601 1.0364 1.1010 1.0996 1.0987 1.1003 1.0991 1.0993 1.1002 1.0906 1.0788 1.0915 1.0930 1.0643
irintensity: 0.0161 0.3645 0.3257 0.1416 0.6743 0.5894 0.3516 1.0892 0.6119 1.6201 2.6283 1.0441 1.4495 1.8879 6.3304 0.3692 0.0688 0.3767 4.4905 0.1784 2.3667 0.1672 0.8335 2.2342 2.2667 3.2659 1.3361 0.0210 17.7307 1.4292 8.3456 29.5219 24.4536 61.2145 70.1835 26.2499 13.0980 19.5970 10.0548 15.3165 7.1085 0.9083 8.7107 7.0789 0.3862 48.8556 34.0410 71.0766 27.6672 1.9884 2.2310 9.1434 0.7466 25.5649 2.0750 4.6647 220.4019 136.5822 10.1742 69.3161 1.4099 30.6157 6.9887 166.7485 126.1664 254.9705 31.3347 334.8743 44.2417 2.9660 88.7993 38.1953 30.0964 7.9837 164.7674 23.7081 43.9392 31.0098 12.3070 6.1077 20.3611 7.6874 6.7024 1.1484 8.0213 3.9651 16.9002 37.0086 14.9236 21.8721 162.7662 194.0389 390.8249 125.3441 22.7808 37.5031 15.1807 20.9834 15.0839 18.3770 21.6756 62.3285 19.7923 44.7112 13.1323 16.9246 0.0370 153.6929 23.8140 7.4542 58.6286
temp: 298.150 k
press: 1.00000 atm
elementType: 8 8 8 8 8 8 7 7 7 6 6 6 6 6 6 6 6 6 6 6 6 6 1 1 1 1 1 1 1 1 1 1 1 1 1 1 1 1 1
symmnumber: 1
zpe: 781949.3 jmol-1
zpe.correction: 0.297829 hartree
zpe.thermalcorrener: 0.319726 hartree
zpe.thermalcorrenthalpy: 0.320670 hartree
zpe.thermalcorrgfe: 0.245861 hartree
zpe.sumelectzpe: -1119.371686 hartree
zpe.sumelectthermal: -1119.349789 hartree
zpe.sumelectthermalent: -1119.348845 hartree
zpe.sumelectthermalfe: -1119.423654 hartree
dipole: 8.6831 -5.0393 -1.4309
dipole: 10.1409
quadrupole: -149.8675 -146.5379 -123.5306
quadrupole: -7.5554 -1.0669 -1.2131
quadrupole: -9.8888 -6.5592 16.4481 -7.5554 -1.0669 -1.2131
hfenergy: -1119.6695151 hartree
pointgroup: C01 [X(C13H17N3O6)]
dipole: 3.2867997 1.5427837 1.6537214 debye
polarizability: 290.6709993|-19.306445|182.7427438|24.4521988|37.8537895|148.0601406 unknown
InChI: InChI=1S/C13H17N3O6/c1-8(2)7-13(3,12(17)18)14-10-5-4-9(15(19)20)6-11(10)16(21)22/h4-6,8,14,17H,7H2,1-3H3
charge 0 multiplicity 1
39 atoms
O  4.422165 -0.276606 1.615118
O  3.324063 -1.82306 0.284272
O  -1.688583 -2.820824 -1.956807
O  0.442285 -2.521571 -1.219397
O  -4.888432 2.016046 0.356885
O  -5.251674 0.16562 -0.936152
N  1.018636 -0.472836 0.313175
N  -0.812604 -2.150668 -1.291044
N  -4.485587 0.936245 -0.235916
C  2.098494 0.196086 1.080276
C  2.470559 1.644014 0.59066
C  2.856565 1.916398 -0.896641
C  1.78228 0.219506 2.613267
C  1.712888 1.691436 -1.917379
C  4.146963 1.195926 -1.361065
C  3.313911 -0.746883 0.918233
C  -0.295821 -0.121966 0.189102
C  -1.22592 -0.929128 -0.59103
C  -0.860043 1.059379 0.794664
C  -2.586163 -0.582093 -0.723639
C  -2.201358 1.401061 0.662559
C  -3.068593 0.572501 -0.098636
H  3.317956 1.957995 1.229152
H  1.62665 2.311207 0.848914
H  3.080183 3.005369 -0.905678
H  0.913031 0.858045 2.835213
H  1.558973 -0.79939 2.974361
H  2.651622 0.60907 3.165971
H  1.283201 -1.352815 -0.180789
H  0.770453 2.169738 -1.592123
H  1.515232 0.617813 -2.081957
H  1.991517 2.128884 -2.893815
H  4.981783 1.356979 -0.654542
H  3.991647 0.108362 -1.480624
H  4.458991 1.585265 -2.347412
H  -0.215755 1.718227 1.374644
H  -3.250062 -1.217474 -1.315448
H  5.179332 -0.911858 1.499966
H  -2.606685 2.3015 1.13186
