program: Gaussian 09
title: 000262536
version: EM64L-G09RevD.01
frameworkgroup: C1[X(C16H15NO2)]
method: RPBEPBE
basis: SDD
operation: Freq
keyword: #p
keyword: freq=noraman
keyword: PBEPBE/SDD
title: #p freq=noraman PBEPBE/SDD
converged: YES YES NO NO
title: Mulliken charges:
elementType: O O N C C C C C C C C C C C C C C C C H H H H H H H H H H H H H H H
charge: -0.259679 -0.271755 -0.684944 0.495985 0.308599 -0.285825 0.088590 -0.359704 -0.398779 -0.325052 -0.348352 -0.321132 0.321027 0.496759 -0.364415 -0.371111 -0.438960 -0.422003 -0.536767 0.271076 0.228447 0.236996 0.213825 0.277528 0.202042 0.251012 0.242468 0.217155 0.219101 0.311247 0.310072 0.224561 0.224531 0.247456
chargesum: 0.00000
title: Mulliken charges with hydrogens summed into heavy atoms:
elementType: O O N C C C C C C C C C C C C C C C C
charge: -0.259679 -0.271755 -0.063625 0.495985 0.308599 -0.014749 0.088590 -0.131258 -0.161783 -0.111227 -0.070823 -0.119090 0.321027 0.496759 -0.113403 -0.128643 -0.221804 -0.202901 0.159781
polarizability: 4.78930362e+02 -1.40656800e+01 1.89981956e+02 -3.48939240e-01 5.07408859e-02 7.83194688e+01
1716.lowfreq: -5.4073 -2.8374 -0.0012 -0.0004 0.0008 2.7698 21.1578 25.8622 42.0169
frequency: 20.8790 25.8106 42.0123 58.6844 95.3597 111.8890 144.1101 148.0738 184.2205 190.9393 236.3024 240.5770 289.2643 291.8742 365.5117 373.4644 405.2311 406.5361 408.3671 413.1486 419.2568 435.1563 503.4410 504.6883 520.4937 542.8588 602.4473 632.8775 634.7856 671.5017 718.3135 733.0696 760.5378 792.4960 812.3934 815.5640 825.4964 834.4502 846.2207 878.1884 881.4065 944.1389 948.6464 967.3348 985.0133 993.9975 996.8831 998.9988 1013.5494 1014.2785 1034.4481 1112.5307 1113.1472 1130.6485 1156.4514 1178.1393 1187.5258 1216.5286 1231.5652 1242.5698 1291.0084 1305.4403 1317.0820 1319.0012 1349.7010 1380.8958 1385.8697 1431.1811 1436.5257 1446.3887 1466.7147 1471.8410 1500.1570 1506.2746 1518.7216 1568.5818 1572.6260 1616.8253 1626.9819 1635.3834 1645.4913 2964.1749 3054.1125 3092.6750 3119.3435 3122.3425 3128.4390 3130.0094 3138.2552 3143.1391 3155.6716 3159.9675 3164.3294 3169.2759 3560.3064 3700.4836
redmass: 3.4954 4.0177 5.4829 4.9392 5.1894 3.9303 4.5380 3.4767 5.9507 1.8832 4.3143 1.5014 5.0607 4.3104 3.9382 4.0478 4.2882 1.3883 1.3083 1.5662 2.9157 4.9449 2.8614 4.5684 2.3841 4.8438 6.4926 6.8679 6.9143 3.2342 5.5187 3.3449 3.6110 6.1335 1.3239 1.3262 5.5813 1.5857 1.7400 4.4037 1.9973 1.3809 1.3954 1.3612 8.8048 3.3191 1.3526 2.6432 1.2286 1.6453 2.3692 1.2627 1.3753 1.2270 1.3298 1.2648 1.1611 1.4690 2.9499 2.5620 1.4515 1.5794 2.0577 1.7937 2.0370 4.0545 4.4050 3.7191 1.1897 4.4578 1.0498 1.0797 2.8572 6.4216 3.1033 6.8152 6.7667 6.0529 4.8039 2.9479 1.5677 1.0327 1.1041 1.0889 1.0885 1.0889 1.0951 1.0939 1.0896 1.0901 1.0927 1.0938 1.0942 1.0964 1.0450 1.1040
irintensity: 0.2199 3.0754 1.8167 0.5387 0.1953 8.8727 1.5920 0.3839 0.8343 0.6964 1.9050 0.2547 6.5357 8.9077 0.3733 0.2966 27.0975 40.0861 272.5882 2.1409 0.6947 0.3982 2.2028 15.0934 29.5379 47.1811 21.9152 3.4115 1.4878 5.3383 3.1292 0.2042 1.0763 10.0380 34.7179 0.6243 5.3633 122.6036 23.0708 0.0583 2.3500 3.9211 0.1793 0.7671 60.2874 15.8013 0.1007 7.2556 40.2172 27.4278 70.0727 0.4592 9.3253 50.1769 12.7850 444.3051 86.3757 33.1142 313.5109 185.5213 25.2562 28.9958 53.7587 128.5968 146.4296 27.9023 55.0314 62.1820 12.8002 16.4556 14.1316 68.6347 269.2127 106.3760 8.9173 94.4850 22.4310 564.3663 326.1548 105.8917 254.8359 99.4955 45.6010 0.8135 16.5485 34.9596 32.0430 2.7986 9.9598 1.7106 30.8231 8.8852 21.0353 10.0824 159.4766 22.7359
temp: 298.150 k
press: 1.00000 atm
elementType: 8 8 7 6 6 6 6 6 6 6 6 6 6 6 6 6 6 6 6 1 1 1 1 1 1 1 1 1 1 1 1 1 1 1
symmnumber: 1
zpe: 705076.1 jmol-1
zpe.correction: 0.268549 hartree
zpe.thermalcorrener: 0.286024 hartree
zpe.thermalcorrenthalpy: 0.286969 hartree
zpe.thermalcorrgfe: 0.221335 hartree
zpe.sumelectzpe: -822.546129 hartree
zpe.sumelectthermal: -822.528654 hartree
zpe.sumelectthermalent: -822.527709 hartree
zpe.sumelectthermalfe: -822.593343 hartree
dipole: 0.3448 -3.4744 0.0384
dipole: 3.4917
quadrupole: -40.4382 -108.4572 -119.3892
quadrupole: -23.0056 -0.2474 -0.0318
quadrupole: 48.9900 -19.0290 -29.9610 -23.0056 -0.2474 -0.0318
hfenergy: -822.8146779 hartree
pointgroup: C01 [X(C16H15N1O2)]
dipole: -0.1217348 1.3583119 0.1653601 debye
polarizability: 478.6062367|-17.0943654|188.9642586|-0.2064481|12.1541781|79.6612923 unknown
InChI: InChI=1S/C16H15NO2/c1-19-15-9-2-12(3-10-15)4-11-16(18)13-5-7-14(17)8-6-13/h2-11H,17H2,1H3
charge 0 multiplicity 1
34 atoms
O  6.132895 1.172263 0.074572
O  -1.622572 -2.374173 -0.33891
N  -6.733656 1.531939 0.085041
C  2.201535 -0.434663 -0.11281
C  -2.919874 -0.357936 -0.119301
C  0.855661 -1.006578 -0.176963
C  -1.624294 -1.09972 -0.198779
C  2.460645 0.965389 0.023577
C  3.324565 -1.305305 -0.188058
C  -3.034726 1.051152 0.053614
C  -4.126351 -1.110274 -0.220838
C  -0.3450 -0.346353 -0.114803
C  4.872506 0.568323 0.005402
C  -5.488423 0.91622 0.018691
C  3.768612 1.461225 0.081786
C  4.648641 -0.824748 -0.130686
C  -4.288178 1.680757 0.122398
C  -5.383274 -0.498639 -0.155403
C  7.310933 0.301832 0.003916
H  0.786611 -2.099432 -0.287844
H  1.624879 1.670621 0.084168
H  3.151515 -2.383244 -0.293132
H  -2.14093 1.677186 0.138977
H  -4.032834 -2.19355 -0.352602
H  -0.378774 0.742241 -0.004475
H  3.97161 2.531427 0.185877
H  5.482542 -1.530084 -0.191513
H  -4.349127 2.767775 0.256625
H  -6.29556 -1.102447 -0.237243
H  -7.588069 0.986805 0.011965
H  -6.814164 2.537157 0.209365
H  7.347972 -0.245272 -0.95781
H  7.327255 -0.419105 0.843914
H  8.172932 0.98031 0.079183
