program: Gaussian 09
title: 000262533
version: EM64L-G09RevD.01
frameworkgroup: C1[X(C18H25NO2)]
method: RPBEPBE
basis: SDD
operation: Freq
keyword: #p
keyword: freq=noraman
keyword: PBEPBE/SDD
title: #p freq=noraman PBEPBE/SDD
converged: YES YES NO NO
title: Mulliken charges:
elementType: O O N C C C C C C C C C C C C C C C C C C H H H H H H H H H H H H H H H H H H H H H H H H H
charge: -0.264322 -0.252614 -0.417449 -0.377549 -0.371554 -0.377207 -0.352468 -0.393613 -0.356539 -0.284240 0.313658 0.109086 -0.612659 -0.695681 0.235791 -0.391308 0.259464 -0.393841 -0.352471 -0.259066 -0.217720 0.194496 0.194619 0.190333 0.190265 0.194716 0.194750 0.188433 0.188386 0.212809 0.212784 0.195203 0.195193 0.225968 0.225717 0.256097 0.255955 0.209880 0.215838 0.209873 0.302377 0.304139 0.229389 0.226470 0.218733 0.219878
chargesum: 0.00000
title: Mulliken charges with hydrogens summed into heavy atoms:
elementType: O O N C C C C C C C C C C C C C C C C C C
charge: -0.264322 -0.252614 -0.113310 0.011566 0.009045 0.012259 0.024351 0.031980 0.033857 0.167446 0.313658 0.109086 -0.100607 -0.060090 0.235791 -0.088931 0.259464 -0.164452 -0.126000 -0.040333 0.002157
polarizability: 2.96499504e+02 1.25942893e+01 2.09062433e+02 1.58898297e-02 -1.46188528e-01 1.22375021e+02
1716.lowfreq: -3.2054 -0.0016 0.0007 0.0018 1.9611 7.1879 10.5238 22.1181 24.2264
frequency: 6.8676 21.9179 24.0774 29.7330 42.5228 53.4471 66.7990 84.3124 101.3033 122.1722 133.1355 136.3166 145.6795 146.9301 176.4537 188.0265 221.8283 235.1599 236.8814 288.1749 302.2344 335.7254 399.1532 422.1046 449.9746 458.2293 487.0292 509.1185 536.0944 546.9399 577.3552 594.9902 618.2533 685.6351 721.1953 729.1469 738.1816 747.4856 752.1782 761.1284 780.4013 790.9067 836.7355 850.8086 858.5707 867.1506 874.7423 890.2788 927.3501 936.5477 936.7040 948.0616 968.7437 995.5574 1010.0508 1010.7704 1023.3776 1047.3246 1050.6981 1077.5548 1079.8456 1086.9679 1093.1437 1109.3058 1126.7227 1133.7708 1150.5902 1166.6905 1187.9909 1198.9734 1220.6915 1223.3941 1231.2144 1250.2518 1258.1143 1263.7553 1276.0079 1283.4841 1293.3530 1294.6408 1297.1114 1301.8787 1307.0074 1337.0835 1354.7559 1358.0770 1360.1072 1375.6299 1391.7337 1395.3609 1422.3734 1438.0201 1460.6898 1461.4053 1462.5050 1466.7760 1468.8080 1474.5703 1478.6054 1480.5846 1481.1812 1486.5426 1489.3239 1569.4913 1587.8433 1632.3099 1642.5205 2950.6972 2952.3972 2955.6862 2962.5183 2968.2749 2968.3033 2972.2054 2984.9546 2989.3848 2993.1596 3000.3399 3004.1843 3005.2556 3021.8500 3036.3024 3045.8616 3068.7127 3070.7530 3074.5903 3120.2631 3127.7119 3142.0727 3160.9405 3252.9910 3615.8587
redmass: 4.3323 4.2457 4.1773 2.0841 3.5330 3.5563 4.2684 1.6862 2.5927 4.5012 1.9071 5.0307 2.3561 2.5140 2.6279 4.3109 4.1323 1.1229 6.5767 3.9636 4.0555 4.6538 3.5920 2.8451 4.3775 3.6288 3.2265 1.2960 2.8188 7.0918 3.0487 5.8548 3.2967 6.2016 1.0616 1.0805 5.1708 1.3242 1.1085 3.8110 5.3435 1.1605 1.3147 1.4454 1.2071 5.6818 6.1060 1.9870 1.3978 1.2090 6.4459 2.2944 1.3013 4.5511 1.1144 2.1228 3.6429 3.2292 3.0881 2.4456 2.2716 2.3489 1.6114 2.7364 2.9716 1.6540 1.4594 1.0849 1.6481 1.1131 1.2874 1.3812 2.6537 1.5372 1.2438 1.2972 1.1175 1.0547 2.3485 1.1126 1.1010 1.4026 1.7871 1.4141 1.5988 1.6656 1.7773 1.6556 1.2184 4.8647 2.2289 1.1308 4.2867 1.0745 1.0742 1.0682 1.0826 1.0799 1.0420 1.1208 2.7720 1.0857 1.0961 6.4002 6.2636 6.9002 9.5465 1.0590 1.0589 1.0592 1.0591 1.0605 1.0586 1.0367 1.0970 1.0598 1.0993 1.0566 1.0962 1.1022 1.1041 1.1043 1.1046 1.1007 1.0993 1.1079 1.0850 1.0888 1.0951 1.1001 1.0992 1.0809
irintensity: 0.0268 0.0480 0.0208 0.4162 1.4931 0.0029 0.4105 0.4605 0.0723 1.4522 0.4526 0.0618 0.8757 4.9646 7.9733 1.0306 7.7119 0.0011 6.3687 0.8820 1.4169 15.4386 1.3573 10.9386 2.3941 7.8552 1.9151 87.1431 15.1775 0.1108 9.6574 8.0662 0.5918 3.7067 14.4476 0.0915 2.3060 110.2634 4.1878 5.6460 3.9075 0.2360 16.6545 6.9949 0.6812 0.2805 6.2456 2.9614 5.3451 1.4935 73.8957 4.4976 0.1114 4.0439 0.0477 11.5887 7.7166 1.0183 1.8324 2.7267 19.0182 110.4351 65.2071 450.0913 3.1521 67.8160 1.4425 1.4401 0.0007 0.2402 10.5025 0.1258 3.6839 0.8723 0.0133 1.0677 0.3870 0.4636 1.0199 0.1344 0.0593 9.6986 38.5414 0.1520 13.7091 21.1236 65.9926 7.9120 11.5398 14.6635 5.2940 23.1803 23.6716 0.0361 0.0588 0.5327 0.1128 3.1009 12.4342 0.0088 2.2511 3.4726 32.5477 0.0612 1.5106 2.8653 148.1933 0.0566 1.6865 0.2380 23.7946 26.6671 148.6269 35.5805 0.0723 17.7583 0.4455 42.5228 5.0860 1.0940 0.0737 72.1741 51.9476 87.7821 54.6196 86.6667 3.8250 3.6847 39.8796 31.7017 5.2672 57.6119
temp: 298.150 k
press: 1.00000 atm
elementType: 8 8 7 6 6 6 6 6 6 6 6 6 6 6 6 6 6 6 6 6 6 1 1 1 1 1 1 1 1 1 1 1 1 1 1 1 1 1 1 1 1 1 1 1 1 1
symmnumber: 1
zpe: 1028027.0 jmol-1
zpe.correction: 0.391555 hartree
zpe.thermalcorrener: 0.413916 hartree
zpe.thermalcorrenthalpy: 0.414860 hartree
zpe.thermalcorrgfe: 0.334707 hartree
zpe.sumelectzpe: -904.542734 hartree
zpe.sumelectthermal: -904.520373 hartree
zpe.sumelectthermalent: -904.519429 hartree
zpe.sumelectthermalfe: -904.599581 hartree
dipole: -1.2758 -0.5587 0.0111
dipole: 1.3928
quadrupole: -112.2235 -122.1607 -130.1026
quadrupole: -8.4795 0.0795 -0.1327
quadrupole: 9.2721 -0.6651 -8.6070 -8.4795 0.0795 -0.1327
hfenergy: -904.9342886 hartree
pointgroup: C01 [X(C18H25N1O2)]
dipole: 0.4983598 0.1521539 0.1695676 debye
polarizability: 296.0759363|8.9948421|163.6766979|10.7209909|43.4930807|168.1843232 unknown
InChI: InChI=1S/C18H25NO2/c1-2-3-4-5-6-9-12-21-18(20)13-15-14-19-17-11-8-7-10-16(15)17/h7-8,10-11,14,19H,2-6,9,12-13H2,1H3
charge 0 multiplicity 1
46 atoms
O  0.460247 -0.004331 0.031943
O  -0.811588 1.352803 1.429021
N  -5.117071 1.15053 1.211148
C  5.453979 -0.253717 -0.179188
C  6.809976 0.264309 0.350617
C  4.238111 0.419514 0.496164
C  8.025807 -0.409885 -0.323965
C  2.888393 -0.10547 -0.047336
C  9.383461 0.108298 0.203303
C  1.700706 0.571091 0.636112
C  -3.297949 0.195292 0.213673
C  -4.501859 -0.362176 -0.381577
C  -1.902523 -0.201036 -0.194629
C  10.592206 -0.570943 -0.476079
C  -5.630527 0.256963 0.265094
C  -3.713937 1.112448 1.179094
C  -0.752477 0.484424 0.528198
C  -4.736274 -1.324944 -1.399648
C  -6.963945 -0.058639 -0.076366
C  -6.064135 -1.644007 -1.744947
C  -7.166246 -1.017658 -1.090403
H  5.401755 -0.08884 -1.275627
H  5.396172 -1.351697 -0.026886
H  6.862356 0.100585 1.447528
H  6.868502 1.362438 0.197417
H  4.298373 1.517633 0.345689
H  4.289611 0.251351 1.592148
H  7.969797 -1.508077 -0.170092
H  7.974584 -0.247546 -1.421169
H  2.828497 0.070738 -1.138629
H  2.821134 -1.199813 0.105903
H  9.433958 -0.053946 1.2995
H  9.438863 1.20542 0.049088
H  1.680111 0.382533 1.72575
H  1.692591 1.665608 0.476842
H  -1.754991 -1.293313 -0.067901
H  -1.749463 -0.024657 -1.279278
H  10.576334 -1.664895 -0.310467
H  11.550076 -0.183526 -0.082706
H  10.580795 -0.398111 -1.568969
H  -3.105715 1.730392 1.83351
H  -5.669385 1.739801 1.829372
H  -3.899647 -1.81479 -1.911662
H  -7.814542 0.419218 0.42289
H  -6.259836 -2.384663 -2.528439
H  -8.187882 -1.286908 -1.381239
