program: Gaussian 09
title: 000262508
version: EM64L-G09RevD.01
frameworkgroup: C1[X(C6H8BrN3S)]
method: RPBEPBE
basis: SDD
operation: Freq
keyword: #p
keyword: freq=noraman
keyword: PBEPBE/SDD
title: #p freq=noraman PBEPBE/SDD
converged: NO YES NO NO
title: Mulliken charges:
elementType: Br S N N N C C C C C C H H H H H H H H
charge: -0.011554 0.258317 -0.006731 -0.006784 -0.622621 0.295998 -0.408377 0.298699 -0.776398 -0.418394 -0.825351 0.250087 0.255616 0.250156 0.332735 0.339196 0.277784 0.277725 0.239900
chargesum: 0.00000
title: Mulliken charges with hydrogens summed into heavy atoms:
elementType: Br S N N N C C C C C C
charge: -0.011554 0.258317 -0.006731 -0.006784 0.049309 0.295998 -0.408377 0.298699 -0.020540 -0.418394 -0.029942
polarizability: 2.00018272e+02 6.98549457e+00 1.25911713e+02 -1.76112337e-03 -6.08721583e-03 5.37180166e+01
1716.lowfreq: -7.0310 -0.0012 0.0017 0.0019 1.6131 4.8799 54.0863 78.3291 119.4908
frequency: 54.0835 78.2802 119.4896 131.0354 137.9676 170.7650 192.8435 213.7992 226.8467 280.8043 283.6245 320.0926 460.1860 485.4430 511.8616 529.3922 539.6352 572.6467 574.8283 660.1265 663.3153 764.6445 878.9475 939.5410 968.2705 981.4726 998.9816 1027.8535 1043.6866 1075.4943 1243.6258 1279.6206 1343.7659 1348.2218 1393.6069 1434.7782 1442.8351 1451.4885 1452.4473 1462.6431 1490.8843 1544.6081 1618.2318 2991.3627 3024.0787 3070.3505 3126.5747 3147.5286 3157.4082 3541.5459 3694.1625
redmass: 5.5823 3.7333 1.0869 1.0524 4.6305 3.6326 4.5408 6.3903 9.8847 8.4054 3.8995 3.7184 7.1103 1.1565 5.3068 4.4479 1.1668 3.5533 5.9206 9.9727 7.3102 9.2843 6.0991 4.1680 3.2583 1.1781 1.3664 2.1209 1.5677 2.2450 6.1626 6.1825 3.4956 1.3682 1.2633 1.0524 1.4138 5.6092 1.0693 1.0451 2.7173 3.3663 1.6026 1.0379 1.0283 1.0968 1.0991 1.1038 1.1057 1.0446 1.1052
irintensity: 0.0424 4.7936 1.4021 0.8912 1.5884 6.0463 2.7213 0.1174 3.0379 1.1026 5.3593 3.0950 10.7278 201.3564 4.0005 9.4308 64.4902 26.8127 5.9049 6.8281 1.4775 13.5160 17.8194 6.3090 19.1751 8.0698 1.6974 106.5468 6.3719 12.4654 340.2880 20.2323 53.7079 1.1039 24.7247 15.0253 70.8421 52.3699 59.7752 14.7891 81.8988 185.4149 455.7202 7.2726 25.3259 10.6707 8.5624 11.6843 12.0974 97.3267 50.2447
temp: 298.150 k
press: 1.00000 atm
elementType: 35 16 7 7 7 6 6 6 6 6 6 1 1 1 1 1 1 1 1
symmnumber: 1
zpe: 359751.3 jmol-1
zpe.correction: 0.137022 hartree
zpe.thermalcorrener: 0.149231 hartree
zpe.thermalcorrenthalpy: 0.150175 hartree
zpe.thermalcorrgfe: 0.097524 hartree
zpe.sumelectzpe: -808.404397 hartree
zpe.sumelectthermal: -808.392189 hartree
zpe.sumelectthermalent: -808.391244 hartree
zpe.sumelectthermalfe: -808.443896 hartree
dipole: 1.8131 -0.2912 0.0143
dipole: 1.8363
quadrupole: -78.1424 -72.2306 -84.2966
quadrupole: 10.2572 -0.0399 0.0056
quadrupole: 0.0808 5.9926 -6.0734 10.2572 -0.0399 0.0056
hfenergy: -808.5414193 hartree
pointgroup: C01 [X(C6H8Br1N3S1)]
dipole: -0.6888519 0.2169732 -0.0192529 debye
dipolederiv: -0.8305697 0.1913607 -0.0295634 0.182669 -0.1312851 0.005558 -0.0290451 0.0057282 -0.0257493 -0.7703064 0.0247113 -0.0295144 0.2301797 0.0436972 0.0130426 -0.0260048 0.0036624 -0.0818511 -1.180489 0.1626733 -0.0400354 0.6595786 -0.829263 0.0160495 -0.0304649 -0.0055559 -0.1669501 -1.4114017 -0.3572383 -0.0585906 -0.161004 -0.5932226 -0.0149186 -0.0545359 -0.0221702 -0.2121274 -0.74602 -0.6420075 -0.015714 -0.6395238 -0.9746775 -0.0320458 -0.0154182 -0.0322941 -0.6922056 0.5853277 0.0149669 0.0209916 0.1229714 0.7588815 0.0174055 0.0234399 0.0125867 0.0966545 0.879481 -0.3337738 0.0356856 -0.6279141 -0.7015148 -0.0361409 0.0295724 -0.0238016 -0.1605927 0.8635212 0.7099553 0.0401858 0.5821877 1.3039601 0.044721 0.0372091 0.0498734 0.2465231 -0.0026425 0.1517024 0.001386 0.1051825 -0.2604068 -0.0010463 0.0008538 0.001099 0.0274726 1.9620816 -0.0618411 0.0837495 -0.5161906 0.6070424 -0.011459 0.0754348 0.007931 0.0105535 0.131855 0.0988603 0.0063343 0.109117 0.0599691 0.0044747 0.0057178 0.0043298 0.0450961 0.0445551 0.0309967 0.1002256 0.0076711 0.0498773 -0.010311 0.0841331 -0.0505276 -0.0151081 -0.0309743 -0.1408843 -0.0089069 -0.0482135 0.0645199 -0.0030482 -0.0071358 -0.0070236 0.1154156 0.0596694 0.030211 -0.0927646 0.0097493 0.0473209 0.013877 -0.0776695 0.0557085 -0.0276305 0.2299133 0.0635696 -0.0046421 0.0336551 0.2446876 -0.0013567 -0.0049522 0.0001073 0.3788724 0.1731745 0.0322134 -0.0077388 0.0619839 0.2734861 0.0005934 -0.0071731 -0.0004912 0.3801008 0.0943851 0.0067119 0.0557705 -0.0710902 -0.0179523 -0.0918877 0.0405173 -0.0654326 -0.0219904 0.1024513 0.0020251 -0.0434404 -0.0785849 -0.0247284 0.0854268 -0.0313568 0.0662725 -0.0239804 -0.1540116 0.0157872 -0.0134184 0.0375758 0.0796083 0.0010657 -0.0131219 -0.0000019 0.1274968 unknown
polarizability: 200.2040351|-4.0348674|125.4412215|6.1289044|1.2547219|54.0027442 unknown
InChI: InChI=1S/C6H8BrN3S/c1-3-4(7)5(8)10-6(9-3)11-2/h8H2,1-2H3
charge 0 multiplicity 1
19 atoms
Br -3.392349 0.739505 -0.034777
S  2.841322 -1.015024 0.191943
N  0.841506 0.868835 0.140739
N  0.207622 -1.481647 0.068835
N  -2.026694 -2.157727 -0.03607
C  -0.486238 1.239185 0.092985
C  -1.488215 0.250371 0.032806
C  -1.117391 -1.133729 0.021152
C  -0.781828 2.717832 0.108962
C  1.108424 -0.465965 0.125512
C  3.726409 0.642728 0.270767
H  -1.411026 2.989596 0.976194
H  0.166674 3.272566 0.159636
H  -1.335979 3.023771 -0.797254
H  -3.026458 -1.974152 -0.072286
H  -1.670601 -3.111254 -0.039983
H  3.407264 1.192549 1.166598
H  3.497735 1.230609 -0.628552
H  4.798922 0.396952 0.319592
