program: Gaussian 09
title: 000262507
version: EM64L-G09RevD.01
frameworkgroup: C1[X(C12H16N4O2)]
method: RPBEPBE
basis: SDD
operation: Freq
keyword: #p
keyword: freq=noraman
keyword: PBEPBE/SDD
title: #p freq=noraman PBEPBE/SDD
converged: YES YES NO NO
title: Mulliken charges:
elementType: O O N N N N C C C C C C C C C C C C H H H H H H H H H H H H H H H H
charge: -0.284444 -0.269988 -0.164870 -0.149914 -0.223787 -0.097524 0.138719 0.075817 -0.457583 0.182752 0.211636 -0.195646 -0.315269 -0.611829 -0.601436 0.385778 -0.779050 -0.785618 0.284050 0.236757 0.279472 0.244743 0.269834 0.247197 0.247571 0.267661 0.250679 0.250177 0.222041 0.233725 0.224103 0.224169 0.233283 0.226794
chargesum: 0.00000
title: Mulliken charges with hydrogens summed into heavy atoms:
elementType: O O N N N N C C C C C C C C C C C C
charge: -0.284444 -0.269988 -0.164870 -0.149914 -0.223787 -0.097524 0.138719 0.075817 0.063224 0.182752 0.211636 0.083826 -0.070527 0.152773 0.167081 0.385778 -0.099181 -0.101372
polarizability: 2.44691235e+02 -5.91977391e+00 1.63921095e+02 -7.82113036e+00 -1.72413449e-01 1.00123402e+02
1716.lowfreq: -7.4815 -3.8833 -2.3697 0.0007 0.0007 0.0008 20.7442 28.4600 52.5864
frequency: 20.5987 28.4520 52.5758 74.8983 88.3010 95.3163 107.9661 122.5318 133.0482 146.0721 156.1675 178.8162 234.6731 267.2201 290.2885 291.7909 306.5915 343.3379 367.3515 372.2865 392.0916 402.2658 434.1370 450.1849 491.2666 515.1911 560.1119 608.0604 651.2969 669.1868 704.2921 721.6090 745.5347 777.4161 780.8340 819.0146 861.3691 911.1667 948.6544 953.3888 962.0255 992.8755 1006.5852 1034.5222 1048.0767 1083.9708 1123.0475 1129.6010 1131.7792 1154.4292 1163.8325 1201.4535 1209.8972 1224.2871 1239.9436 1265.3236 1290.9813 1297.4438 1349.8192 1360.6104 1379.6457 1390.4750 1401.7010 1412.5350 1425.1228 1429.9174 1454.7355 1464.0445 1468.3750 1472.4723 1472.6454 1474.1168 1477.1959 1478.2865 1495.6735 1502.2027 1569.4679 1612.1580 1645.6076 1693.8653 2964.5273 2972.1504 3008.0621 3008.4886 3012.5255 3037.9276 3043.1831 3062.0338 3086.1366 3094.2655 3097.4529 3100.0749 3104.2339 3139.0544 3139.6619 3249.2399
redmass: 4.2157 3.0881 3.5628 1.0415 2.0250 1.6614 3.1968 1.0906 2.9629 3.4366 6.6331 1.3267 3.7921 3.0976 2.8477 4.3821 3.0350 3.2425 5.0840 6.1076 5.4164 3.4205 7.0187 2.5460 5.4512 2.9543 5.7815 4.4412 5.3153 8.5464 10.8887 4.3446 10.3508 5.2722 2.2577 1.4311 1.6737 3.7847 1.5048 2.4822 2.7806 1.2530 2.9009 1.9194 3.0853 1.6854 2.4168 1.3024 1.3011 2.8905 1.9507 2.2200 2.3711 3.1245 2.2640 4.1179 1.9728 6.6451 2.2225 2.1680 2.2060 1.2877 1.2519 1.4009 1.2791 1.9267 1.0513 1.1176 1.3896 1.0517 1.0503 1.1034 1.0423 1.0719 1.2889 1.8571 8.1643 10.7875 9.8921 6.3785 1.0374 1.0385 1.0377 1.0553 1.0329 1.0969 1.0964 1.1025 1.0987 1.0958 1.1025 1.0911 1.1021 1.1023 1.1014 1.0986
irintensity: 0.1321 0.1628 0.4786 0.0204 0.0565 0.8396 0.9110 0.7129 11.5981 5.2545 1.4583 2.0402 2.0357 2.2133 3.7667 1.2209 2.8017 7.7758 4.2734 13.0023 13.5905 2.7092 14.9406 8.7509 18.8089 2.4354 1.5011 11.8216 5.5414 0.3474 9.1779 17.3220 9.4725 0.2135 9.8372 19.3532 25.6012 3.9111 2.1849 19.5041 19.9812 5.0346 62.2640 8.1134 17.7463 4.9542 19.7495 0.3780 0.1463 32.1953 47.8974 70.1100 20.3633 6.0207 25.4726 19.6597 16.2783 43.0182 12.3832 4.6302 48.5226 27.4965 31.4093 14.1544 51.6083 161.4470 1.6661 19.3923 12.7105 16.1318 26.5604 25.1906 16.3103 3.4736 68.9276 106.5738 5.2481 693.9687 345.5828 16.0343 32.4553 39.1108 44.1349 20.3632 26.8045 9.1772 30.7981 7.9808 18.1900 29.6652 17.0397 34.4000 17.9498 0.8078 0.5235 1.4125
temp: 298.150 k
press: 1.00000 atm
elementType: 8 8 7 7 7 7 6 6 6 6 6 6 6 6 6 6 6 6 1 1 1 1 1 1 1 1 1 1 1 1 1 1 1 1
symmnumber: 1
zpe: 712885.3 jmol-1
zpe.correction: 0.271524 hartree
zpe.thermalcorrener: 0.290008 hartree
zpe.thermalcorrenthalpy: 0.290953 hartree
zpe.thermalcorrgfe: 0.223295 hartree
zpe.sumelectzpe: -835.017342 hartree
zpe.sumelectthermal: -834.998857 hartree
zpe.sumelectthermalent: -834.997913 hartree
zpe.sumelectthermalfe: -835.065570 hartree
dipole: -5.0581 1.0173 0.4102
dipole: 5.1757
quadrupole: -100.1285 -112.6505 -104.0514
quadrupole: -1.0017 -0.9519 -0.3632
quadrupole: 5.4816 -7.0403 1.5587 -1.0017 -0.9519 -0.3632
hfenergy: -835.2888657 hartree
pointgroup: C01 [X(C12H16N4O2)]
dipole: -1.9731434 0.4971926 -0.0770609 debye
polarizability: 244.3240356|-9.8481582|158.7848821|1.5265227|-18.6892832|105.6268144 unknown
InChI: InChI=1S/C12H16N4O2/c1-8(2)5-6-16-7-13-10-9(16)11(17)15(4)12(18)14(10)3/h5,7H,6H2,1-4H3
charge 0 multiplicity 1
34 atoms
O  0.4775 -2.462225 0.750059
O  4.543957 -0.183345 0.029013
N  -0.901497 0.245588 -0.007665
N  2.562686 1.031638 -0.299919
N  2.504721 -1.284883 0.38671
N  0.338033 2.083685 -0.581149
C  0.44985 -0.128035 0.086473
C  1.176321 1.02098 -0.271044
C  -2.079637 -0.608892 0.325064
C  1.069683 -1.380597 0.435046
C  3.280717 -0.139443 0.036266
C  -0.911685 1.569923 -0.407514
C  -3.191866 -0.44581 -0.685282
C  3.29358 2.256627 -0.678359
C  3.287396 -2.495627 0.727258
C  -4.480622 -0.071786 -0.435815
C  -5.49605 -0.014202 -1.565241
C  -5.034744 0.290837 0.930995
H  -1.699736 -1.646749 0.346499
H  -2.411977 -0.364686 1.349206
H  -1.833154 2.121966 -0.571254
H  -2.909726 -0.693004 -1.718917
H  4.368563 2.031214 -0.627418
H  3.041113 3.07629 0.014867
H  3.014564 2.562728 -1.700434
H  2.569498 -3.286715 0.98815
H  3.958853 -2.28434 1.57522
H  3.904632 -2.802146 -0.133057
H  -5.926365 1.002408 -1.658074
H  -5.051205 -0.291845 -2.535863
H  -6.344455 -0.698774 -1.367594
H  -5.573471 1.256927 0.883264
H  -5.773583 -0.465701 1.261326
H  -4.264496 0.368993 1.715383
