program: Gaussian 09
title: 000262482
version: EM64L-G09RevD.01
frameworkgroup: C1[X(C11H10N2O2)]
method: RPBEPBE
basis: SDD
operation: Freq
keyword: #p
keyword: freq=noraman
keyword: PBEPBE/SDD
title: #p freq=noraman PBEPBE/SDD
converged: YES YES NO NO
title: Mulliken charges:
elementType: O O N N C C C C C C C C C C C H H H H H H H H H H
charge: -0.267208 -0.287106 -0.340924 -0.002287 0.499262 -0.476914 -0.398951 -0.377584 0.244478 -0.223507 -0.222745 0.160661 -0.232026 -0.360614 -0.223725 0.210203 0.275497 0.231790 0.247629 0.227420 0.227643 0.229613 0.266640 0.339410 0.253346
chargesum: 0.00000
title: Mulliken charges with hydrogens summed into heavy atoms:
elementType: O O N N C C C C C C C C C C C
charge: -0.267208 -0.287106 -0.001514 -0.002287 0.499262 0.008786 -0.167162 -0.129956 0.244478 0.003912 0.004898 0.160661 -0.002414 -0.093974 0.029621
polarizability: 2.12042733e+02 -5.40952315e-01 1.28493325e+02 -2.36816409e+00 -6.23498027e+00 8.16153486e+01
1716.lowfreq: -15.8623 -6.0778 -0.0006 -0.0004 0.0006 2.7060 9.1617 17.3086 41.6441
frequency: -6.2537 17.2450 41.6391 101.7756 129.4827 186.0447 235.8498 262.0064 325.3392 335.9049 402.8910 414.8511 441.3869 505.8548 534.8373 555.7383 589.1376 616.9571 630.4071 697.2775 707.0892 733.0817 764.7486 775.4224 827.3243 844.9838 855.2447 862.4982 883.8931 901.0858 931.0955 973.3768 979.0276 991.3168 998.4688 1026.2642 1057.0861 1088.3729 1110.4200 1172.9737 1186.1179 1192.9835 1214.0026 1231.9523 1232.3091 1326.7168 1331.6195 1347.3294 1369.8888 1387.0304 1399.3181 1441.4659 1486.6874 1491.7455 1517.6317 1544.8770 1596.2369 1616.8053 1620.1132 3002.5928 3084.4954 3121.1467 3126.1472 3137.1619 3149.2242 3163.6496 3164.7252 3170.4430 3489.3484
redmass: 5.2551 4.2002 5.9210 5.2701 5.5333 7.2624 5.0929 4.7708 7.3853 2.2852 2.7992 3.6540 5.2298 5.0785 6.1263 6.6169 4.0297 6.3634 6.2513 3.7786 1.9015 2.7583 2.2507 1.7576 4.0285 4.8553 1.2519 1.4257 6.5056 1.5150 1.4989 1.6767 1.3952 6.1114 1.3252 2.1744 2.8239 1.5126 3.9203 1.0551 1.1291 1.2800 2.0581 2.5922 2.5374 1.2729 2.1626 1.3502 1.5492 8.3622 2.3166 2.1817 2.4339 1.1118 5.7882 4.1800 6.1151 6.1700 6.3649 1.0600 1.1063 1.0858 1.0875 1.0922 1.0966 1.0914 1.1017 1.0947 1.0781
irintensity: 0.5561 0.0456 2.8709 6.6871 3.8981 5.9911 1.5117 3.6716 1.9680 1.4037 0.2320 4.7464 5.9943 11.0215 13.5212 5.4314 15.9527 0.1211 27.9928 5.1347 65.3673 12.0544 59.3795 100.4502 31.2305 25.2336 0.1128 12.5007 68.8284 15.5322 1.1418 2.1828 0.0036 0.7444 0.0575 6.4008 104.6218 7.6725 4.1675 0.2921 20.7134 122.7493 55.7606 24.4047 155.7120 0.5204 11.4280 13.9092 4.7498 1.4410 0.6285 10.7274 3.0508 5.2548 44.7054 135.4738 5.4076 39.5496 334.7560 49.5050 18.5073 4.7692 0.3737 16.5870 38.2264 13.8446 22.2996 4.5873 37.3834
temp: 298.150 k
press: 1.00000 atm
elementType: 8 8 7 7 6 6 6 6 6 6 6 6 6 6 6 1 1 1 1 1 1 1 1 1 1
symmnumber: 1
zpe: 500351.1 jmol-1
zpe.correction: 0.190574 hartree
zpe.thermalcorrener: 0.202216 hartree
zpe.thermalcorrenthalpy: 0.203161 hartree
zpe.thermalcorrgfe: 0.150815 hartree
zpe.sumelectzpe: -684.042414 hartree
zpe.sumelectthermal: -684.030771 hartree
zpe.sumelectthermalent: -684.029827 hartree
zpe.sumelectthermalfe: -684.082173 hartree
dipole: -0.9284 0.6456 0.9184
dipole: 1.4567
quadrupole: -65.2345 -90.1781 -87.3205
quadrupole: -11.3953 -3.6410 -6.5416
quadrupole: 15.6766 -9.2671 -6.4095 -11.3953 -3.6410 -6.5416
hfenergy: -684.2329878 hartree
pointgroup: C01 [X(C11H10N2O2)]
dipole: 0.3729726 0.1465429 -0.4097429 debye
dipolederiv: -2.108115 -0.0143685 -0.2604315 0.1390781 -0.2495853 -0.0178668 -0.2471568 0.0010462 -0.2824701 -0.757746 0.1959774 -0.1681836 0.2885641 -0.8636522 0.3562215 -0.2833654 0.3268899 -0.5947572 -0.4086827 0.3388783 -0.2345646 -0.1805035 -0.3511919 0.0702244 0.1146722 0.1307111 -0.3073054 -0.486668 0.1140776 -0.0939606 -0.2131516 -0.3924308 0.0735018 0.0894145 0.1172907 -0.2979671 -0.0100151 0.0168014 -0.0143 -0.0221838 -0.0127916 -0.0057729 0.0711644 -0.0162635 -0.0997754 1.2107803 -0.0679799 0.1224826 -0.4318808 0.2476738 0.0369731 0.5175012 0.075904 0.453484 -0.0588949 -0.0656879 -0.0541748 0.0423872 0.0418568 0.0727434 -0.0280605 0.0628336 -0.1088696 -0.0223587 0.0950389 -0.0006679 0.0225724 0.0006076 0.0366316 0.0102008 0.023752 -0.1209971 1.6304153 0.0379343 0.1934801 0.3919137 -0.2629637 0.311065 -0.2408779 0.2351343 -0.1396388 -0.0384998 0.126145 -0.0030929 0.1450923 0.0290479 0.0275479 0.0057864 0.0235958 -0.1374486 -0.0987375 -0.066957 -0.0455794 -0.078158 0.0740474 0.082933 -0.0560986 0.0994396 -0.105389 0.6771129 -0.3236038 0.2390597 -0.6192295 0.8806687 -0.5011589 0.5366534 -0.4566895 0.5502516 0.0657428 0.0013979 -0.0832608 -0.005845 -0.0460903 0.0372876 -0.0711863 0.0366801 -0.1189499 0.0437284 -0.1445041 0.1059436 0.296966 0.2242455 -0.1746656 -0.2436182 -0.2380485 0.0229756 0.070503 -0.0908839 0.0789186 0.3052512 0.4345323 -0.2665698 -0.1835837 -0.3003015 0.155404 -0.0696666 0.0155046 -0.0181451 0.0578686 -0.0524441 -0.1489482 -0.1447712 -0.0692287 -0.0640258 0.1039426 -0.0042898 0.0423342 0.1030568 0.024542 0.0743092 -0.083405 0.0000954 0.0477196 0.0809719 0.071688 0.0574217 0.0585972 -0.045868 -0.0792793 0.0480558 -0.0836845 0.1018409 0.0398851 -0.1056503 0.0134006 -0.1107465 0.0056885 -0.0281706 0.010093 -0.0141452 0.1305024 -0.0141416 -0.1053104 0.0088516 -0.1259209 -0.0342071 -0.0321622 0.0147967 -0.033593 0.1437388 0.0516061 0.0500366 0.0454865 0.0711865 -0.0652713 -0.0898133 0.0562889 -0.0884768 0.1130145 -0.1150391 0.0121414 0.0819124 0.0116003 0.0937014 -0.0261457 0.0896067 -0.0263622 0.1257284 0.0635012 -0.0583625 0.0205742 -0.0920124 0.0374801 0.0646315 0.052053 0.0636255 0.1185539 0.2004353 0.0214085 -0.0334884 0.0063211 0.1890722 0.0891974 -0.0352192 0.0855277 0.2748049 -0.0500596 -0.0494318 -0.0000161 -0.0608236 0.0933318 0.0372858 0.0010555 0.0442676 0.1395752 unknown
polarizability: 212.0681555|1.1845489|128.1404489|0.7333418|-7.4796421|81.9428024 unknown
InChI: InChI=1S/C11H10N2O2/c14-11-10(6-12-8-13-11)15-7-9-4-2-1-3-5-9/h1-6,8,13H,7H2
charge 0 multiplicity 1
25 atoms
O  0.313642 -0.619482 0.199766
O  1.658724 1.732286 -1.108334
N  3.683378 0.848271 -0.339421
N  3.889573 -1.129054 0.970487
C  -1.966418 -0.162416 -0.529747
C  -0.542787 -0.281795 -1.008336
C  -2.858722 -1.259303 -0.62142
C  -2.428159 1.059299 0.023768
C  1.680204 -0.392634 0.153381
C  -4.191847 -1.14049 -0.16837
C  -3.758397 1.180429 0.480378
C  2.265451 0.801356 -0.488195
C  -4.643651 0.080322 0.384033
C  2.510381 -1.278184 0.845679
C  4.431896 -0.077095 0.370614
H  -0.416769 -1.117969 -1.721228
H  -0.164232 0.656812 -1.444919
H  -2.506368 -2.207958 -1.044822
H  -1.739723 1.909563 0.095533
H  -4.874808 -1.993858 -0.244615
H  -4.106986 2.128048 0.905869
H  -5.677572 0.174922 0.734901
H  2.068253 -2.145592 1.344109
H  4.133202 1.66443 -0.770435
H  5.511333 0.089593 0.427422
