program: Gaussian 09
title: 000262476
version: EM64L-G09RevD.01
frameworkgroup: C1[X(C11H20N2O)]
method: RPBEPBE
basis: SDD
operation: Freq
keyword: #p
keyword: freq=noraman
keyword: PBEPBE/SDD
title: #p freq=noraman PBEPBE/SDD
converged: YES YES NO NO
title: Mulliken charges:
elementType: O N N C C C C C C C C C C C H H H H H H H H H H H H H H H H H H H H
charge: -0.274287 -0.221215 -0.389836 0.339400 -0.507174 -0.035151 -0.728962 -0.732268 0.171757 -0.444771 -0.419832 -0.410992 -0.402180 -0.377485 0.233724 0.261881 0.245491 0.214163 0.245744 0.222016 0.212591 0.237603 0.211187 0.211532 0.200591 0.191197 0.246706 0.181419 0.207305 0.203222 0.204418 0.308101 0.192637 0.201467
chargesum: 0.00000
title: Mulliken charges with hydrogens summed into heavy atoms:
elementType: O N N C C C C C C C C C C C
charge: -0.274287 -0.221215 -0.081735 0.339400 -0.011568 0.210341 -0.047038 -0.070887 0.171757 -0.032648 0.018071 -0.022268 0.005460 0.016619
polarizability: 1.58134398e+02 4.62828557e-01 1.28171375e+02 -4.10025066e+00 -1.81242834e-02 1.12152218e+02
1716.lowfreq: -12.4049 -4.3142 -0.0005 -0.0002 0.0007 14.4126 23.2194 52.6121 58.9338
frequency: 20.7265 52.5544 58.4969 73.6135 127.0211 136.8178 180.1034 207.2449 222.1025 224.2265 265.7882 317.9225 347.7877 357.4982 372.7560 384.9083 419.3112 455.8811 467.6156 488.3892 544.6538 560.3184 635.3496 677.7407 745.2130 757.6830 775.1665 801.8786 832.0888 854.9812 861.1520 890.9014 908.9600 926.7771 949.0896 955.0644 1001.2709 1007.0850 1011.5151 1043.8315 1052.4766 1073.0029 1087.5174 1110.4811 1112.3778 1114.2889 1131.9810 1152.3779 1164.8705 1215.8461 1244.5041 1256.6675 1272.1360 1283.5704 1301.8029 1326.5331 1330.2903 1336.0437 1345.0231 1349.0641 1354.8466 1369.0453 1389.0665 1401.3324 1453.4430 1457.7587 1458.4893 1460.9427 1464.8113 1469.1310 1469.4094 1473.5562 1481.4318 1482.6724 1486.5471 1609.8483 2952.4375 2965.6255 2972.0852 2975.7637 2977.0400 2979.4396 2981.0930 3021.9304 3026.4467 3029.4816 3038.0302 3043.6763 3056.6964 3063.2470 3068.2308 3071.0144 3084.4064 3096.5848 3173.8971 3556.0496
redmass: 3.3765 4.8518 3.5196 3.4365 3.6042 2.9961 1.1232 2.2347 2.4627 1.3080 2.1712 3.3444 2.1116 2.2186 2.3628 2.1683 2.7502 2.5771 3.1515 2.1488 1.8912 1.7931 2.4222 5.0436 4.5127 6.6879 1.5140 3.5077 1.7066 2.8396 2.3563 2.7744 1.3458 1.4528 1.2965 2.1594 1.9270 1.3565 2.5085 1.4797 1.6628 1.6175 1.7027 1.5427 1.1389 1.4490 2.0025 1.7897 2.4247 2.0586 1.3561 1.2857 1.3159 3.2075 1.7069 1.4664 1.3876 1.4425 2.2177 1.7161 1.5050 1.3869 1.2953 1.2381 1.3548 1.1863 1.0594 1.0911 1.0751 1.1018 1.1436 1.0915 1.0742 1.1230 1.1846 8.4462 1.0672 1.0619 1.0639 1.0362 1.0641 1.0368 1.0616 1.0867 1.0937 1.0964 1.1011 1.1018 1.0989 1.0989 1.0975 1.0550 1.1000 1.0993 1.1170 1.0767
irintensity: 0.6621 5.1243 1.7612 3.1509 3.4820 1.4094 0.1956 1.8219 3.7475 0.8421 0.1629 12.6759 0.7685 5.0443 0.9953 1.8999 1.2411 3.8090 4.4569 1.1628 51.3664 32.6556 5.1438 4.8849 1.3953 8.1072 2.2836 15.8127 3.3793 15.3562 7.0839 20.9095 3.3462 7.7614 1.9113 25.3616 15.2956 2.2614 1.9093 1.0718 0.4946 4.2588 0.9017 40.4601 4.2540 5.5115 23.5581 3.7000 0.8326 190.2513 32.9771 8.8763 15.6009 10.9096 17.5633 8.3213 8.0385 1.2993 46.1088 32.7476 7.6718 18.8182 41.4339 13.1134 187.8527 80.1025 11.4077 17.7689 23.3489 41.4318 73.7243 40.4817 8.0161 13.2693 80.4027 194.2197 31.8424 38.8576 26.8999 16.6614 27.4698 33.1660 28.6562 48.1331 76.3082 42.1825 24.1315 91.7492 44.6550 0.1272 44.6659 39.5296 15.7956 23.2798 12.0850 20.2621
temp: 298.150 k
press: 1.00000 atm
elementType: 8 7 7 6 6 6 6 6 6 6 6 6 6 6 1 1 1 1 1 1 1 1 1 1 1 1 1 1 1 1 1 1 1 1
symmnumber: 1
zpe: 781148.6 jmol-1
zpe.correction: 0.297524 hartree
zpe.thermalcorrener: 0.312515 hartree
zpe.thermalcorrenthalpy: 0.313460 hartree
zpe.thermalcorrgfe: 0.254786 hartree
zpe.sumelectzpe: -614.764301 hartree
zpe.sumelectthermal: -614.749310 hartree
zpe.sumelectthermalent: -614.748366 hartree
zpe.sumelectthermalfe: -614.807040 hartree
dipole: -0.1796 3.6427 0.1908
dipole: 3.6521
quadrupole: -74.8096 -92.2837 -86.5473
quadrupole: 3.0348 -0.9374 1.7409
quadrupole: 9.7373 -7.7369 -2.0004 3.0348 -0.9374 1.7409
hfenergy: -615.0618252 hartree
pointgroup: C01 [X(C11H20N2O1)]
dipole: 0.0188331 1.2583059 -0.6934405 debye
polarizability: 157.6299558|-2.258088|125.114752|-5.8995841|-6.1760098|115.7132828 unknown
InChI: InChI=1S/C11H20N2O/c1-11(2)8-13(11)10(14)12-9-6-4-3-5-7-9/h9,12H,3-8H2,1-2H3
charge 0 multiplicity 1
34 atoms
O  -0.767443 -2.085813 0.557602
N  -1.80138 0.025344 1.041814
N  0.269791 -0.071472 -0.029564
C  -2.986739 0.475384 0.170822
C  -3.151575 -0.5802 1.259105
C  1.487371 -0.693681 -0.593393
C  -3.019476 0.023836 -1.285529
C  -3.448062 1.902296 0.43004
C  -0.760683 -0.817201 0.506306
C  2.169417 0.291437 -1.575023
C  2.477218 -1.139172 0.520257
C  2.822665 1.496126 -0.849775
C  3.117922 0.065134 1.248166
C  3.807439 1.025357 0.248138
H  -3.630327 -0.314937 2.208064
H  -3.267382 -1.627083 0.951276
H  1.151737 -1.595699 -1.138288
H  -2.388208 0.676337 -1.917962
H  -2.663781 -1.015333 -1.398868
H  -4.053977 0.077093 -1.672443
H  -4.513367 2.019141 0.155644
H  -3.328363 2.164616 1.494598
H  -2.861418 2.62277 -0.170528
H  1.435777 0.636668 -2.329213
H  2.958057 -0.264168 -2.119684
H  3.272963 -1.750659 0.046892
H  1.941888 -1.796028 1.229349
H  2.043068 2.139557 -0.387862
H  3.345018 2.134279 -1.588184
H  3.848306 -0.29419 1.99815
H  2.334886 0.615386 1.809434
H  0.239126 0.939889 0.106672
H  4.658038 0.498685 -0.232893
H  4.230893 1.898601 0.781081
