program: Gaussian 09
title: 000262479
version: EM64L-G09RevD.01
frameworkgroup: C1[X(C10H18ClN3O2)]
method: RPBEPBE
basis: SDD
operation: Freq
keyword: #p
keyword: freq=noraman
keyword: PBEPBE/SDD
title: #p freq=noraman PBEPBE/SDD
converged: NO YES NO NO
title: Mulliken charges:
elementType: Cl O O N N N C C C C C C C C C C H H H H H H H H H H H H H H H H H H
charge: -0.050497 -0.270438 -0.257253 -0.450933 -0.172539 0.034321 0.409899 -0.518247 -0.454550 -0.413789 -0.396332 -0.384467 -0.741810 0.357079 -0.366232 -0.552005 0.214815 0.212166 0.190674 0.255542 0.202186 0.206445 0.201827 0.213908 0.189209 0.207261 0.211741 0.258396 0.212526 0.344610 0.254837 0.286275 0.269709 0.295666
chargesum: 0.00000
title: Mulliken charges with hydrogens summed into heavy atoms:
elementType: Cl O O N N N C C C C C C C C C C
charge: -0.050497 -0.270438 -0.257253 -0.106323 -0.172539 0.034321 0.409899 -0.091266 -0.008334 -0.005158 0.019403 0.012002 -0.059147 0.357079 0.174880 0.013370
polarizability: 1.61320397e+02 -8.84820195e+00 1.28061834e+02 5.89570420e+00 -6.23294951e+00 1.35685782e+02
1716.lowfreq: -19.4290 -5.3013 -0.0010 0.0005 0.0008 8.8890 25.4571 35.7091 54.9386
frequency: 23.0768 35.1795 54.9056 65.4476 93.5750 101.3963 159.6082 182.4247 191.4745 220.4077 229.3677 239.9362 271.2475 296.1327 318.6267 331.5433 344.0071 360.4496 393.5303 444.8799 467.4528 474.3862 486.9572 512.2286 559.0390 609.7054 653.3719 708.4758 719.4825 759.9002 775.0534 798.3117 832.6422 848.7616 872.4525 893.4856 912.6878 929.7626 938.4698 965.2713 984.8953 1001.7439 1026.9373 1049.4084 1056.7637 1094.1716 1103.0534 1130.3070 1147.1486 1151.3485 1180.4713 1193.0119 1223.2652 1249.0270 1260.7888 1271.2894 1280.9836 1291.5672 1318.1444 1323.2436 1339.2242 1341.6917 1345.1781 1351.2631 1358.6228 1368.5598 1383.8367 1428.4811 1452.2636 1454.9546 1460.3581 1464.8108 1465.7497 1471.0593 1475.4042 1485.3449 1495.8228 1674.5549 2964.6151 2967.3373 2974.7640 2979.4005 2981.7131 2985.7981 3005.0280 3027.8040 3032.8937 3038.9716 3045.6162 3062.0929 3070.2551 3079.6646 3096.7607 3104.8850 3159.4743 3484.2617
redmass: 5.3205 6.8516 8.5842 4.9453 6.4846 4.4239 3.2610 3.0300 3.8376 5.7486 1.0425 3.4555 2.1375 3.3611 5.7190 2.5767 2.4816 2.8740 2.8761 2.9514 2.9802 2.5970 6.3286 3.2080 2.0214 4.8780 1.1390 10.6928 3.5433 3.9791 1.5600 3.1569 2.7363 1.6177 2.1711 2.3319 2.3023 1.6313 2.0322 2.2035 1.5536 2.8824 1.5800 1.9274 1.8284 1.2467 1.5207 2.6221 1.6718 2.9123 2.3303 1.3989 2.7556 1.8201 1.3501 1.3820 1.5396 1.5787 1.2892 1.3890 1.3686 1.4720 1.6391 4.4177 1.4442 1.3733 1.2249 1.0925 1.0982 1.0945 1.1056 1.1031 1.1057 1.0790 1.1076 1.0584 1.5182 9.7256 1.0661 1.0606 1.0630 1.0631 1.0501 1.0501 1.0639 1.0971 1.0957 1.1008 1.1012 1.0989 1.0582 1.0995 1.0998 1.0974 1.1097 1.0766
irintensity: 0.2427 1.5271 1.3163 0.7570 3.7583 3.9617 1.7186 4.7484 4.3352 5.4577 0.0462 4.3938 0.9058 13.7572 3.1688 2.3997 7.9576 6.3884 0.8121 0.4090 6.1377 2.7588 2.7188 4.9016 2.5306 16.1542 77.9013 25.5936 13.3175 39.5355 5.5926 4.8235 4.1112 7.4786 10.3910 52.4683 46.5330 17.9976 106.4849 7.6535 4.8048 13.9099 4.2632 39.6082 29.6080 1.0859 0.6870 11.5211 0.4799 30.0892 27.9464 9.5149 27.2105 19.6160 7.0278 0.9925 28.7090 4.5853 50.8121 8.2665 0.3981 2.6880 34.6355 87.1324 7.3166 21.3726 15.8416 33.0362 12.2311 13.1045 29.9237 57.8351 42.2548 32.7667 20.9034 24.6047 258.0486 206.7215 27.0768 29.1194 39.7812 17.0858 4.8092 60.4518 10.9221 47.1907 54.5116 11.5269 97.8830 20.0133 19.8093 43.3952 15.6576 2.0592 3.8932 37.3984
temp: 298.150 k
press: 1.00000 atm
elementType: 17 8 8 7 7 7 6 6 6 6 6 6 6 6 6 6 1 1 1 1 1 1 1 1 1 1 1 1 1 1 1 1 1 1
symmnumber: 1
zpe: 737445.1 jmol-1
zpe.correction: 0.280878 hartree
zpe.thermalcorrener: 0.297736 hartree
zpe.thermalcorrenthalpy: 0.298681 hartree
zpe.thermalcorrgfe: 0.235218 hartree
zpe.sumelectzpe: -1165.324568 hartree
zpe.sumelectthermal: -1165.307710 hartree
zpe.sumelectthermalent: -1165.306765 hartree
zpe.sumelectthermalfe: -1165.370228 hartree
dipole: -1.3763 -0.8258 0.1239
dipole: 1.6098
quadrupole: -87.9794 -107.6656 -113.2486
quadrupole: -1.5213 -5.4683 3.9907
quadrupole: 14.9852 -4.7011 -10.2841 -1.5213 -5.4683 3.9907
hfenergy: -1165.6054461 hartree
pointgroup: C01 [X(C10H18Cl1N3O2)]
dipole: -0.491343 -0.2806255 -0.2845643 debye
polarizability: 162.5226469|-8.2940367|137.4661215|2.3978411|-4.1285856|125.0792443 unknown
InChI: InChI=1S/C10H18ClN3O2/c1-10(5-3-2-4-6-10)12-9(15)14(13-16)8-7-11/h12H,2-8H2,1H3
charge 0 multiplicity 1
34 atoms
Cl 2.529971 1.824774 1.88863
O  0.802051 1.306372 -1.439712
O  2.847186 -2.276044 0.596793
N  -0.460435 -0.481508 -0.562321
N  1.898664 -0.451721 -0.314927
N  1.756637 -1.737294 0.187567
C  -1.836327 -0.037654 -0.954606
C  -2.820592 -1.097319 -0.3808
C  -2.151524 1.356264 -0.332312
C  -2.871107 -1.122808 1.167061
C  -2.177341 1.332458 1.212634
C  -3.178062 0.279182 1.743921
C  -1.940479 0.018133 -2.498197
C  0.682234 0.210156 -0.827884
C  3.19576 0.249245 -0.364327
C  3.723597 0.652359 1.018751
H  -2.562926 -2.098957 -0.78165
H  -3.827542 -0.850451 -0.769729
H  -3.146308 1.665535 -0.712794
H  -1.415983 2.092683 -0.701334
H  -1.905841 -1.482063 1.580312
H  -3.636902 -1.851951 1.494533
H  -2.443212 2.337704 1.591555
H  -1.162081 1.109009 1.597297
H  -4.207716 0.575022 1.452609
H  -3.153766 0.247714 2.85002
H  -2.956315 0.33413 -2.797219
H  -1.216117 0.740835 -2.910602
H  -1.74121 -0.975024 -2.940962
H  -0.346481 -1.374014 -0.070075
H  3.940811 -0.428233 -0.825534
H  3.043548 1.130016 -1.007735
H  4.667482 1.207901 0.915788
H  3.846027 -0.207653 1.68995
