program: Gaussian 09
title: 000262471
version: EM64L-G09RevD.01
frameworkgroup: C1[X(C7H14Cl2N2O)]
method: RPBEPBE
basis: SDD
operation: Freq
keyword: #p
keyword: freq=noraman
keyword: PBEPBE/SDD
title: #p freq=noraman PBEPBE/SDD
converged: YES YES NO NO
title: Mulliken charges:
elementType: Cl Cl O N N C C C C C C C H H H H H H H H H H H H H H
charge: -0.111086 -0.085744 -0.308614 -0.397999 -0.406771 -0.320088 -0.352689 -0.306075 -0.313547 0.302270 -0.630914 -0.641517 0.261359 0.236885 0.231995 0.277313 0.283256 0.305207 0.294392 0.293294 0.245848 0.221389 0.231370 0.247273 0.218943 0.224249
chargesum: 0.00000
title: Mulliken charges with hydrogens summed into heavy atoms:
elementType: Cl Cl O N N C C C C C C C
charge: -0.111086 -0.085744 -0.308614 -0.103607 -0.113477 0.178156 0.156620 -0.022820 -0.008339 0.302270 0.067694 0.048947
polarizability: 1.51789763e+02 6.17595068e+00 1.05329582e+02 3.27595863e-01 -8.56659760e+00 8.39744394e+01
1716.lowfreq: -21.5442 -8.1900 -0.0021 -0.0020 0.0004 3.6771 5.7867 24.7639 41.2205
frequency: -7.4781 24.5937 41.1954 65.7158 70.1700 79.3624 188.2765 216.2498 227.9202 229.2021 241.8574 255.3184 274.8681 319.9397 326.4636 353.2499 389.1280 404.5457 440.5166 525.4839 556.8785 570.0314 639.2025 669.2768 714.3886 853.2897 879.3439 890.9318 925.1360 965.4909 1005.4375 1027.6655 1061.0373 1100.9338 1121.9347 1135.2382 1137.1120 1185.4530 1199.7856 1211.6358 1233.7381 1272.5373 1276.7222 1296.1339 1344.6316 1359.6234 1369.3347 1386.7401 1394.6748 1436.5787 1442.6416 1459.2619 1462.3912 1463.7155 1474.4536 1474.7300 1507.2592 1628.0519 2983.3154 2984.0517 2987.3996 3023.1439 3048.7551 3072.0779 3074.1748 3086.4812 3088.3929 3097.7067 3110.0437 3112.8796 3542.3144 3561.9598
redmass: 5.9037 3.5350 6.3615 8.3168 5.4013 4.3959 4.3708 3.9228 1.5477 1.1876 2.1470 1.9538 2.7839 3.8799 2.3408 1.6055 2.6330 2.0182 4.8685 2.2201 2.0868 2.4209 3.8776 3.7658 9.4996 2.0186 2.7861 1.7912 1.4857 1.8962 1.5224 1.9979 3.1144 2.5606 2.0593 2.0354 2.1575 3.2264 1.1899 1.2634 1.6228 1.2422 1.2868 1.2964 1.3612 1.2274 1.4031 1.2413 1.2138 1.2288 1.0896 1.2722 1.0546 1.0930 1.0529 1.0511 2.3699 5.2840 1.0368 1.0495 1.0489 1.0604 1.0996 1.0957 1.0940 1.0946 1.0925 1.1014 1.0985 1.0998 1.0774 1.0779
irintensity: 2.0345 0.4308 1.9651 16.0371 6.5437 3.7740 2.0689 2.8323 2.1891 0.1664 3.6648 0.1433 4.5846 14.4916 11.3748 7.7822 22.4774 6.5005 9.8867 87.0341 111.8153 93.7334 35.2411 0.8476 12.5837 6.5042 9.3435 13.2150 7.0941 7.7667 38.6919 10.5272 32.5480 6.2444 11.1687 5.1610 7.2274 2.4985 38.3070 3.0896 201.0084 2.2357 92.5902 27.4002 13.2396 2.1065 2.1363 31.4569 17.9143 38.0514 7.0288 6.7901 19.9496 14.7319 11.6627 13.2264 647.2669 150.7992 16.8283 17.6904 47.2115 22.4285 6.5167 14.6414 3.3874 10.3636 21.7262 9.4213 22.9678 24.0967 26.5133 16.0069
temp: 298.150 k
press: 1.00000 atm
elementType: 17 17 8 7 7 6 6 6 6 6 6 6 1 1 1 1 1 1 1 1 1 1 1 1 1 1
symmnumber: 1
zpe: 553752.4 jmol-1
zpe.correction: 0.210913 hartree
zpe.thermalcorrener: 0.225068 hartree
zpe.thermalcorrenthalpy: 0.226013 hartree
zpe.thermalcorrgfe: 0.167858 hartree
zpe.sumelectzpe: -1379.056239 hartree
zpe.sumelectthermal: -1379.042084 hartree
zpe.sumelectthermalent: -1379.041139 hartree
zpe.sumelectthermalfe: -1379.099294 hartree
dipole: 2.7944 2.2441 -0.8720
dipole: 3.6885
quadrupole: -100.5826 -90.4279 -82.0275
quadrupole: -14.1666 5.4122 -2.4360
quadrupole: -9.5699 0.5848 8.9852 -14.1666 5.4122 -2.4360
hfenergy: -1379.267152 hartree
pointgroup: C01 [X(C7H14Cl2N2O1)]
dipole: -0.990918 0.7315965 0.7672687 debye
dipolederiv: -0.3313988 0.0913697 0.0165545 0.1160265 -0.4614506 -0.1943675 0.0149364 -0.2560417 -0.4725905 -0.6952201 0.155061 0.1598676 0.1423854 -0.3164588 -0.041016 0.165384 -0.0253339 -0.2393552 -0.8338828 0.0394781 0.0310475 -0.0001884 -0.6176763 -0.2642097 0.0337274 -0.3154097 -0.7174713 -1.6197099 0.1564646 0.0711861 0.2633134 -0.4750014 0.1136328 0.1515966 0.0920353 -0.4246052 -1.4777316 -0.1669058 -0.0734629 -0.412861 -0.4716434 0.0944248 -0.3013567 0.0466437 -0.5284771 0.5928973 0.0633975 0.0548824 0.3004005 0.0778517 -0.1387942 0.363439 -0.1892658 0.07182 0.6506258 0.0447504 -0.0616574 0.0202889 0.1021144 -0.0949075 -0.2795919 -0.0243942 0.2455794 0.2825956 -0.121563 -0.0435648 -0.1925275 0.5326101 0.3559665 -0.0954829 0.340119 0.5888134 0.7637838 -0.1967893 -0.1930622 -0.2306012 0.3854075 0.1047524 -0.1775703 0.0503554 0.1850785 2.5041128 -0.0120573 -0.0096258 0.0669994 0.6816744 0.4452888 0.1050796 0.52427 0.8645851 -0.1429459 0.0158048 -0.056115 0.0455177 -0.0366087 -0.0687169 -0.1100915 -0.0754109 -0.0706127 -0.0559044 0.0478847 0.0642429 -0.0362765 -0.1860791 -0.0035352 0.0698621 -0.0081361 0.0229803 0.1882022 0.0452812 0.0354534 -0.0234374 0.0620073 -0.0611218 -0.0809086 -0.0167305 0.0436108 -0.1476206 -0.0816123 0.0494649 -0.0888467 0.0421899 0.0608463 0.0318421 0.1107485 0.016362 -0.0560083 -0.0076 -0.0754434 -0.0457373 0.103514 -0.0382322 -0.0623887 -0.0019318 -0.0682422 0.0547923 -0.0344162 0.0088794 0.0187033 -0.0548953 0.0047707 0.0776272 -0.0284206 0.0875253 -0.0121516 -0.0503033 0.0703018 -0.0267157 -0.0413543 -0.0063857 0.0652436 -0.0035856 -0.0413148 -0.0161606 0.0226258 -0.0547349 0.0248171 0.0186828 -0.0324496 -0.0273701 -0.0195905 -0.0209923 0.174964 -0.0209462 0.0045544 -0.0974635 0.2546912 -0.1434804 -0.0318181 -0.1147727 0.2023527 0.0734633 0.0212988 0.018557 0.0426723 0.2240402 -0.1414473 0.0038441 -0.1187996 0.2032702 -0.0024074 0.0665963 -0.0627047 0.101255 -0.0270035 0.0731761 -0.0539222 0.051852 0.085199 0.0718337 0.0147431 0.024844 0.0164565 0.0282106 -0.1276505 0.0368965 -0.1137563 -0.037748 0.0327024 -0.0676425 0.0318334 -0.0874706 0.0363982 0.0666157 0.0994193 0.0957962 0.0090226 0.0728112 -0.0721141 0.0594906 -0.0507404 0.0230788 0.0736534 0.0760269 0.1026452 -0.0317177 -0.1091017 0.0903006 0.0338552 0.1219027 0.0427202 -0.0352435 0.0429249 -0.0488718 0.0905003 0.0374591 -0.0431064 -0.1046441 0.0121274 0.0729801 -0.0015691 -0.1173488 -0.0540137 -0.0635725 unknown
polarizability: 150.0377435|-9.0991326|95.8712469|-5.3831766|14.545119|95.1847943 unknown
InChI: InChI=1S/C7H14Cl2N2O/c1-5(8)3-10-7(12)11-4-6(2)9/h5-6,10-11H,3-4H2,1-2H3
charge 0 multiplicity 1
26 atoms
Cl -3.710856 1.600273 1.104867
Cl 4.79073 -0.4053 -0.781883
O  0.183817 -1.475688 -0.582337
N  -1.211997 -0.330651 0.913272
N  1.130393 -0.215871 1.142785
C  -2.442217 -0.751584 0.247959
C  2.500919 -0.591791 0.769119
C  -3.240508 0.414418 -0.350849
C  3.037837 0.265912 -0.39929
C  0.039081 -0.718404 0.429451
C  -4.527458 -0.01032 -1.051183
C  3.14736 1.761826 -0.111758
H  -2.138559 -1.431886 -0.570786
H  -3.094012 -1.317885 0.941522
H  3.159588 -0.472757 1.648002
H  2.509177 -1.651394 0.463678
H  -2.600828 1.052607 -0.980837
H  2.469625 0.051371 -1.317522
H  -1.306244 0.302549 1.709555
H  0.988907 0.406577 1.938316
H  -5.096445 0.864479 -1.405426
H  -4.278875 -0.639938 -1.92774
H  -5.173472 -0.596272 -0.374488
H  3.578967 2.298903 -0.972445
H  2.13952 2.176778 0.080794
H  3.784652 1.951448 0.770524
