program: Gaussian 09
title: 000262468
version: EM64L-G09RevD.01
frameworkgroup: C1[X(C11H22N2O)]
method: RPBEPBE
basis: SDD
operation: Freq
keyword: #p
keyword: freq=noraman
keyword: PBEPBE/SDD
title: #p freq=noraman PBEPBE/SDD
converged: YES YES NO NO
title: Mulliken charges:
elementType: O N N C C C C C C C C C C C H H H H H H H H H H H H H H H H H H H H H H
charge: -0.312412 -0.415944 -0.656583 0.052443 0.330489 -0.511867 -0.500843 -0.024370 -0.475267 -0.442709 -0.745840 -0.759598 -0.747110 0.264867 0.178279 0.182311 0.221644 0.214913 0.204378 0.259326 0.201813 0.214294 0.240132 0.193527 0.210808 0.207582 0.218351 0.211950 0.221354 0.210676 0.215354 0.208841 0.211074 0.284939 0.296394 0.336804
chargesum: 0.00000
title: Mulliken charges with hydrogens summed into heavy atoms:
elementType: O N N C C C C C C C C C C C
charge: -0.312412 -0.131006 -0.023385 0.230722 0.330489 -0.107912 -0.081551 0.234956 -0.059160 -0.009050 -0.109098 -0.115618 -0.111841 0.264867
polarizability: 1.57364136e+02 3.65217157e+00 1.22578495e+02 4.03437495e+00 -5.24346157e+00 1.18239211e+02
1716.lowfreq: -20.6233 -0.0009 -0.0003 0.0002 0.8708 5.9960 17.3210 26.8236 48.6079
frequency: 16.7300 22.9756 48.4367 86.5193 144.5052 173.2446 190.4454 198.4109 223.0975 238.6417 243.3254 250.8727 276.8942 324.2866 337.6958 353.1095 379.1837 387.1757 435.2686 438.7583 459.6690 462.9173 472.8931 507.6194 516.3279 609.9463 641.9942 718.0617 750.2882 775.8337 810.8135 848.4893 901.0910 912.3317 919.5486 926.4011 927.5596 935.4465 938.6320 993.4192 1012.7609 1018.0772 1035.0554 1049.6622 1061.6689 1079.5805 1091.4722 1130.4038 1154.2917 1173.2601 1193.9668 1228.6183 1238.4939 1247.0485 1267.6356 1274.7998 1296.3628 1306.1842 1318.5561 1326.2299 1340.1109 1343.0723 1359.7962 1373.9336 1375.3036 1376.3419 1402.0982 1454.3766 1458.8956 1464.4729 1465.9776 1467.0120 1471.5128 1471.6696 1485.9508 1487.1280 1491.6830 1499.3871 1597.4021 1644.7303 2916.0019 2954.7210 2966.6817 2968.3721 2971.7713 2974.3875 2976.6373 2980.1878 3033.4008 3035.8135 3040.9094 3045.6394 3054.1182 3056.6296 3058.6382 3064.6064 3067.7559 3072.6134 3076.6890 3540.5302 3554.2754 3701.1616
redmass: 4.1327 3.0395 3.9269 3.2872 3.0262 1.6278 3.2887 2.0722 1.1623 1.2706 1.2323 1.4038 2.4518 2.3258 1.9573 2.4908 2.0784 2.4743 2.4716 1.4238 2.3273 2.0834 2.3489 1.2537 2.3183 4.7371 2.9272 8.7453 2.7011 1.5118 2.5655 2.9914 2.3819 2.0487 1.7665 1.7441 1.7576 1.7239 1.2713 1.6762 1.4503 1.8730 2.1239 1.7151 2.1894 1.7980 1.2872 2.0437 1.8342 1.4332 2.1351 2.5500 2.1031 1.6275 1.6145 1.3985 1.3411 1.3852 1.6284 1.4518 1.5709 1.4857 1.4469 1.3868 1.2064 1.2314 1.2073 1.0909 1.0592 1.0744 1.0522 1.0832 1.2624 1.1110 1.3713 1.0534 1.2326 1.0719 1.3610 3.4711 1.0814 1.0666 1.0358 1.0368 1.0554 1.0476 1.0593 1.0617 1.0862 1.0943 1.0999 1.0958 1.0988 1.0994 1.0991 1.0982 1.0991 1.0978 1.0974 1.0489 1.0735 1.1038
irintensity: 3.5376 6.4180 6.0310 7.3552 5.3595 0.5997 3.8426 4.2886 7.3962 0.2986 0.2642 0.1587 0.9287 0.1678 1.1745 1.7741 0.2266 3.5922 24.1397 286.9746 44.2571 39.7079 12.5200 9.7068 2.9494 2.5744 6.3461 18.5282 3.7342 0.3029 0.3506 3.6212 6.9997 1.6167 3.5463 0.3865 4.6433 5.5939 1.4208 12.3197 2.4076 10.8085 1.6517 3.2489 1.3607 0.8381 0.3609 3.6862 6.0204 2.0679 20.7067 5.4606 24.0448 1.8096 42.4388 0.5782 1.2009 24.3457 15.4491 0.4901 19.7039 17.8595 1.2732 43.0892 22.7267 9.9721 20.1498 22.2008 4.1665 4.1217 8.4275 9.8096 125.6271 41.7071 263.2625 6.9136 100.6799 30.2716 110.8073 275.5829 16.8347 26.8421 27.6558 41.0555 20.0525 19.8692 44.2939 43.4084 19.9034 57.6417 23.2826 54.4504 31.6855 4.4164 32.4575 89.7566 22.7609 67.1120 58.6569 37.1434 5.7161 34.3191
temp: 298.150 k
press: 1.00000 atm
elementType: 8 7 7 6 6 6 6 6 6 6 6 6 6 6 1 1 1 1 1 1 1 1 1 1 1 1 1 1 1 1 1 1 1 1 1 1
symmnumber: 1
zpe: 840050.0 jmol-1
zpe.correction: 0.319958 hartree
zpe.thermalcorrener: 0.336187 hartree
zpe.thermalcorrenthalpy: 0.337131 hartree
zpe.thermalcorrgfe: 0.275678 hartree
zpe.sumelectzpe: -615.987029 hartree
zpe.sumelectthermal: -615.970800 hartree
zpe.sumelectthermalent: -615.969856 hartree
zpe.sumelectthermalfe: -616.031309 hartree
dipole: -2.6498 2.0900 -2.8351
dipole: 4.4076
quadrupole: -99.8372 -82.2165 -88.2476
quadrupole: 11.3200 -10.4218 -2.9259
quadrupole: -9.7367 7.8839 1.8528 11.3200 -10.4218 -2.9259
hfenergy: -616.3069868 hartree
pointgroup: C01 [X(C11H22N2O1)]
dipole: -1.0377446 -0.691765 1.2048468 debye
polarizability: 157.3794269|-3.9744299|121.289203|-3.6375671|-5.6066028|119.5132113 unknown
InChI: InChI=1S/C11H22N2O/c1-11(2,3)8-4-6-9(7-5-8)13-10(12)14/h8-9,13H,4-7,12H2,1-3H3
charge 0 multiplicity 1
36 atoms
O  4.011377 0.114642 -0.848238
N  2.114426 -0.079662 0.507241
N  3.926498 -1.566433 0.767968
C  -1.553795 0.414624 -0.184522
C  -2.879295 -0.415043 0.033722
C  -0.819372 0.791975 1.132892
C  -0.539704 -0.255175 -1.154179
C  1.418708 1.061773 -0.126842
C  0.417017 1.690095 0.869229
C  0.684597 0.648424 -1.429722
C  -3.582373 -0.647262 -1.334016
C  -2.605578 -1.794329 0.69431
C  -3.859986 0.386581 0.936085
C  3.380655 -0.472294 0.085916
H  -1.871095 1.372628 -0.659837
H  -0.51523 -0.136728 1.662032
H  -1.499668 1.325866 1.821655
H  -1.027573 -0.498595 -2.115358
H  -0.189507 -1.215944 -0.724191
H  2.204692 1.794267 -0.386056
H  0.069238 2.649883 0.438205
H  0.932464 1.930366 1.819374
H  1.403994 0.144054 -2.100134
H  0.35192 1.572712 -1.946057
H  -3.736886 0.309563 -1.86923
H  -4.574156 -1.113102 -1.181152
H  -3.000759 -1.316715 -1.992569
H  -2.144306 -1.685824 1.693599
H  -1.938958 -2.419935 0.072902
H  -3.554471 -2.348217 0.82601
H  -3.481279 0.496873 1.968017
H  -4.83602 -0.13104 0.996673
H  -4.0391 1.399607 0.526778
H  1.612173 -0.620263 1.211797
H  3.487347 -2.015905 1.568217
H  4.854004 -1.864772 0.478578
