program: Gaussian 09
title: 000262440
version: EM64L-G09RevD.01
frameworkgroup: C1[X(C6H4N6)]
method: RPBEPBE
basis: SDD
operation: Freq
keyword: #p
keyword: freq=noraman
keyword: PBEPBE/SDD
title: #p freq=noraman PBEPBE/SDD
converged: NO NO YES YES
title: Mulliken charges:
elementType: N N N N N N C C C C C C H H H H
charge: -0.398171 0.016395 0.015896 -0.070023 -0.617368 -0.013492 -0.049437 -0.074990 0.276341 0.185520 -0.367016 -0.212270 0.363418 0.251548 0.348428 0.345222
chargesum: 0.00000
title: Mulliken charges with hydrogens summed into heavy atoms:
elementType: N N N N N N C C C C C C
charge: -0.034753 0.016395 0.015896 -0.070023 0.076281 -0.013492 -0.049437 -0.074990 0.276341 0.185520 -0.115468 -0.212270
polarizability: 1.54468161e+02 1.24329548e+01 1.21887719e+02 1.58448409e-03 3.06800136e-03 4.21487375e+01
1716.lowfreq: 0.0005 0.0006 0.0008 2.2583 3.2537 5.4706 89.0322 113.0638 184.2912
frequency: 89.0271 113.0596 184.2902 203.2160 292.2077 302.3170 428.0748 474.9835 488.0822 496.9163 517.1484 551.4345 568.5971 593.4005 630.5112 658.2481 672.7224 699.7315 727.5039 805.6043 846.2368 944.9466 965.1568 1036.9692 1116.0087 1159.7115 1230.1339 1248.2937 1331.6630 1336.7505 1356.8341 1376.5489 1430.1694 1477.9989 1529.3994 1595.0286 1630.8416 2163.5786 3167.8693 3529.4640 3588.4443 3681.3867
redmass: 6.1016 9.1829 8.4756 6.3860 4.1563 6.5914 7.0914 1.8565 2.0910 5.9623 10.7126 4.4495 1.2532 8.3147 7.0301 5.6119 9.3033 1.1860 8.4854 10.7814 8.9582 1.4390 2.2822 7.5679 4.1489 7.4460 4.6538 4.2814 5.0443 2.0908 6.7509 2.7287 2.1676 3.0098 4.6594 3.7032 1.7046 12.5913 1.0923 1.0454 1.0827 1.1051
irintensity: 6.9152 8.1970 1.1998 0.4563 1.7567 7.2888 4.9615 57.7867 66.3647 0.1673 0.4098 9.6259 132.0141 9.3065 0.7901 37.3909 13.6832 83.1926 1.6770 16.3534 11.0955 10.7548 8.1337 25.4699 21.4677 40.2132 17.2596 12.2036 28.7490 23.0952 57.6275 9.6879 0.5126 48.2036 166.9710 60.4129 377.7589 87.4270 18.1054 99.1764 141.2055 44.8621
temp: 298.150 k
press: 1.00000 atm
elementType: 7 7 7 7 7 7 6 6 6 6 6 6 1 1 1 1
symmnumber: 1
zpe: 282561.0 jmol-1
zpe.correction: 0.107622 hartree
zpe.thermalcorrener: 0.116644 hartree
zpe.thermalcorrenthalpy: 0.117588 hartree
zpe.thermalcorrgfe: 0.073221 hartree
zpe.sumelectzpe: -558.694914 hartree
zpe.sumelectthermal: -558.685892 hartree
zpe.sumelectthermalent: -558.684948 hartree
zpe.sumelectthermalfe: -558.729315 hartree
dipole: 2.3298 1.7116 0.0001
dipole: 2.8910
quadrupole: -79.5554 -64.1654 -69.5169
quadrupole: -11.8031 -0.0006 0.0001
quadrupole: -8.4761 6.9138 1.5623 -11.8031 -0.0006 0.0001
hfenergy: -558.8025359 hartree
pointgroup: C01 [X(C6H4N6)]
dipole: 1.0062486 -0.5302059 -0.0000306 debye
dipolederiv: 0.0420826 -0.70978 -0.0000247 -0.5614525 -0.1748955 0.0000052 -0.0000235 0.0000065 -0.169409 -0.4890515 0.3906573 0.0000167 -0.2116961 -0.1575025 0.0000036 0.0000011 -0.0000033 -0.1884675 -0.671749 -0.1316677 0.0000024 -0.1811897 -0.6743651 -0.00002 -0.0000021 -0.0000116 -0.2097887 -0.8572432 0.5831841 0.0000287 -0.0545477 -0.6022363 -0.0000095 0.0000049 -0.0000266 -0.239019 -0.5242564 0.6576327 0.0000241 0.4276516 -1.0344972 -0.0000203 0.0000159 -0.0000249 -0.6706702 -0.568834 0.020933 -0.0000024 0.1577829 -0.219514 0.000001 0.000012 0.0000004 -0.2292842 -0.1028327 -0.1812472 -0.0000042 0.2145097 -0.5410876 -0.0000236 0.0000112 -0.000017 0.0335077 0.7348342 0.1461938 -0.0000058 0.4416333 0.0751279 -0.0000062 0.0000014 -0.0000031 0.0957503 -0.3177595 0.322587 0.000017 0.4905372 0.3092196 0.000001 0.0000184 0.0000024 0.11936 0.8576061 -0.7149347 -0.0000366 -0.3397823 1.3041278 0.000045 -0.0000199 0.0000464 0.2284495 0.6998784 -0.1978614 -0.0000143 0.0262028 0.8503845 0.0000349 0.0000081 0.0000453 -0.039409 0.7038614 -0.1486147 -0.000007 -0.3563299 -0.0505015 -0.0000016 -0.0000198 -0.0000031 0.067522 0.2249479 0.0677749 0.0000031 0.0467703 0.3275813 -0.0000002 0.0000033 0. 0.329187 -0.0772724 -0.0269877 0.0000015 -0.0464989 0.0866876 -0.0000011 -0.0000131 -0.0000063 0.1238307 0.182427 -0.0764527 -0.0000009 -0.0348553 0.2122275 -0.0000056 0.0000002 -0.0000028 0.3714654 0.163361 -0.0014167 0.0000025 -0.0187354 0.2892435 -0.0000026 0.0000018 -0.0000024 0.3769751 unknown
polarizability: 157.3958673|-7.1148394|118.9600127|-0.0020214|0.0027995|42.1487375 unknown
InChI: InChI=1S/C6H4N6/c7-1-3-4-5(8)9-2-10-6(4)12-11-3/h2,11H,8H2
charge 0 multiplicity 1
16 atoms
N  0.971267 1.953377 0.000015
N  -0.371167 2.246244 0.000038
N  -2.32823 0.771148 0.000018
N  -1.806726 -1.636654 -0.000075
N  0.368779 -2.50866 -0.000139
N  3.707109 -0.380482 -0.000111
C  0.023606 -0.062248 -0.000042
C  -0.968502 0.992768 0.000006
C  1.280455 0.594603 -0.000031
C  -0.462601 -1.419044 -0.000088
C  -2.65079 -0.541261 -0.000009
C  2.601874 0.086659 -0.000062
H  1.636051 2.727603 0.000031
H  -3.718088 -0.782275 -0.000037
H  1.382731 -2.420795 -0.000144
H  -0.060967 -3.433182 -0.000167
