program: Gaussian 09
title: 000262448
version: EM64L-G09RevD.01
frameworkgroup: C1[X(C16H10N2)]
method: RPBEPBE
basis: SDD
operation: Freq
keyword: #pfreq=noraman
keyword: PBEPBE/SDD
title: #p freq=noraman PBEPBE/SDD
converged: YES YES NO NO
title: Mulliken charges:
elementType: N N C C C C C C C C C C C C C C C C H H H H H H H H H H
charge: 0.017001 0.010674 -0.440366 0.322948 0.252716 0.169183 0.157275 -0.124404 -0.432183 -0.387420 -0.390132 -0.394857 -0.241803 -0.245123 -0.227315 -0.226532 -0.140882 -0.171272 0.283276 0.295714 0.238243 0.259992 0.245095 0.243537 0.231424 0.232917 0.231510 0.230786
chargesum: 0.00000
title: Mulliken charges with hydrogens summed into heavy atoms:
elementType: N N C C C C C C C C C C C C C C C C
charge: 0.017001 0.010674 -0.157091 0.322948 0.252716 0.169183 0.157275 0.171310 -0.193940 -0.127429 -0.145037 -0.151320 -0.010379 -0.012206 0.004195 0.004254 -0.140882 -0.171272
polarizability: 2.31477570e+02 1.76938528e+01 1.84364752e+02 -1.30870151e+01 2.13373848e+01 1.03794211e+02
1716.lowfreq: -8.1730 -0.0004 -0.0002 0.0005 3.8136 4.6967 39.3332 53.6284 85.8668
frequency: 39.3205 53.6276 85.8662 93.6419 123.8694 143.8908 164.3769 205.4038 220.3800 293.7422 321.1417 366.0337 407.9233 422.7924 444.7939 447.1268 479.9028 506.9549 556.7047 563.4503 568.4665 617.1436 642.8319 680.1350 722.0782 745.3515 749.8930 759.8233 792.6055 800.2740 848.3558 875.1520 881.9431 898.6566 948.5503 956.9959 989.5069 993.3701 995.4002 996.6695 1020.1221 1024.0703 1032.2244 1100.4387 1113.4782 1164.4239 1169.7136 1173.9796 1181.0288 1190.8513 1210.0753 1244.2078 1262.6426 1299.4997 1305.2492 1309.7645 1378.2662 1404.6617 1440.7995 1445.8850 1469.3871 1485.2594 1592.9917 1595.2407 1619.1660 1620.5224 2204.4882 2211.7394 2983.2097 2994.8784 3115.8830 3129.7212 3132.4562 3139.8899 3146.8509 3151.1064 3165.5801 3167.4315
redmass: 8.9658 6.5599 7.3349 5.0830 10.3649 4.0432 7.2227 4.9848 6.4778 4.3746 6.4621 8.0708 5.7063 3.3041 3.4609 6.7420 4.9643 4.9939 5.0108 12.0957 3.5173 6.9627 6.1393 4.2023 4.7902 1.8314 1.7944 2.8907 2.0757 3.2096 3.6937 1.8948 1.5198 2.6933 1.4333 1.4322 1.3389 1.3395 4.3466 6.5591 3.8005 2.2781 2.0633 2.0732 1.7365 1.4625 1.1682 1.1239 1.2383 1.9753 1.6242 1.7465 1.4190 1.5477 1.8027 1.5686 8.5738 3.8019 2.2217 2.7087 2.6160 4.0068 6.5199 7.0036 7.3577 7.0273 12.5704 12.5722 1.0804 1.0837 1.0889 1.0859 1.0874 1.0896 1.0937 1.0951 1.1001 1.1003
irintensity: 1.1550 0.6690 2.4232 3.1467 2.7012 0.7748 1.9463 2.0435 1.7001 0.1665 3.3595 0.0751 1.1218 7.9830 0.0644 0.3317 0.8925 0.3509 2.4270 0.1884 0.6432 6.0344 4.6232 21.7572 0.3290 0.7867 120.9918 40.8755 0.8190 6.9825 2.7746 1.8466 0.1296 0.8821 1.5455 1.5268 0.0530 0.0362 1.8509 2.5636 10.1369 0.9467 7.8758 4.6898 0.3995 1.5632 2.4115 0.4984 0.1002 4.8119 1.7471 1.2350 1.1177 0.3838 0.4886 1.2483 3.8747 1.0028 28.9140 13.0178 9.8356 0.7443 0.9172 0.2870 4.3495 1.0461 2.7893 1.2164 0.7179 6.4665 10.7807 3.0511 2.1270 3.2289 14.7484 23.4318 36.8511 19.4595
temp: 298.150 k
press: 1.00000 atm
elementType: 7 7 6 6 6 6 6 6 6 6 6 6 6 6 6 6 6 6 1 1 1 1 1 1 1 1 1 1
symmnumber: 1
zpe: 549093.9 jmol-1
zpe.correction: 0.209139 hartree
zpe.thermalcorrener: 0.223301 hartree
zpe.thermalcorrenthalpy: 0.224246 hartree
zpe.thermalcorrgfe: 0.167427 hartree
zpe.sumelectzpe: -723.977574 hartree
zpe.sumelectthermal: -723.963411 hartree
zpe.sumelectthermalent: -723.962467 hartree
zpe.sumelectthermalfe: -724.019286 hartree
dipole: -3.4256 1.2175 -2.5128
dipole: 4.4194
quadrupole: -103.1806 -92.1924 -116.3147
quadrupole: 10.5167 -0.9201 7.4159
quadrupole: 0.7153 11.7035 -12.4188 10.5167 -0.9201 7.4159
hfenergy: -724.1867123 hartree
pointgroup: C01 [X(C16H10N2)]
dipole: 1.3591677 -0.4859412 -0.969393 debye
polarizability: 230.7868512|18.9294151|183.6386783|13.3789117|-23.3986322|105.2110031 unknown
InChI: InChI=1S/C16H10N2/c17-9-11(10-18)16-14-7-3-1-5-12(14)13-6-2-4-8-15(13)16/h1-8,11,16H
charge 0 multiplicity 1
28 atoms
N  -0.710506 1.603876 2.603548
N  -3.44455 2.430111 -0.789152
C  -0.30082 0.739801 -0.84954
C  1.195891 0.59245 -0.564825
C  -0.854505 -0.637794 -0.474538
C  1.472107 -0.718513 -0.077626
C  0.207078 -1.477903 -0.022151
C  -0.925149 1.945933 -0.038848
C  2.22469 1.534632 -0.727851
C  -2.173879 -1.118716 -0.539264
C  2.793227 -1.091277 0.250021
C  -0.051884 -2.806718 0.375065
C  3.551497 1.160216 -0.396381
C  -2.432795 -2.452797 -0.134458
C  3.829493 -0.141756 0.08832
C  -1.381136 -3.286977 0.318049
C  -0.818389 1.75293 1.426593
C  -2.327961 2.211507 -0.434366
H  -0.482496 0.96654 -1.919199
H  -0.338629 2.852627 -0.2961
H  2.02247 2.542642 -1.110802
H  -2.99462 -0.484974 -0.891556
H  3.018526 -2.095204 0.625805
H  0.756548 -3.45858 0.72367
H  4.367557 1.880807 -0.516201
H  -3.455899 -2.841695 -0.173926
H  4.860079 -0.413847 0.341487
H  -1.601543 -4.314918 0.626325
