program: Gaussian 09
title: 000262477
version: EM64L-G09RevD.01
frameworkgroup: C1[X(C18H18Cl2N6O4)]
method: RPBEPBE
basis: SDD
operation: Freq
keyword: #p
keyword: freq=noraman
keyword: PBEPBE/SDD
title: #p freq=noraman PBEPBE/SDD
converged: YES YES NO NO
title: Mulliken charges:
elementType: Cl Cl O O O O N N N N N N C C C C C C C C C C C C C C C C C C H H H H H H H H H H H H H H H H H H
charge: -0.037132 -0.037132 -0.250311 -0.250311 -0.227373 -0.227374 -0.471093 -0.471093 -0.192151 -0.192150 0.037985 0.037985 0.367699 0.367699 0.482902 0.482902 -0.374765 -0.374764 -0.387398 -0.387398 -0.470367 -0.470366 -0.362493 -0.362494 0.306149 0.306147 -0.333071 -0.333066 -0.570347 -0.570348 0.238993 0.238994 0.241064 0.241065 0.230786 0.230786 0.297723 0.297722 0.350522 0.350523 0.276831 0.272575 0.276828 0.272574 0.295010 0.278261 0.295013 0.278260
chargesum: 0.00000
title: Mulliken charges with hydrogens summed into heavy atoms:
elementType: Cl Cl O O O O N N N N N N C C C C C C C C C C C C C C C C C C
charge: -0.037132 -0.037132 -0.250311 -0.250311 -0.227373 -0.227374 -0.120571 -0.120570 -0.192151 -0.192150 0.037985 0.037985 0.367699 0.367699 0.482902 0.482902 -0.135771 -0.135770 -0.146333 -0.146334 -0.239581 -0.239581 -0.064771 -0.064772 0.306149 0.306147 0.216336 0.216336 0.002924 0.002925
polarizability: 6.62413162e+02 1.41140815e-04 2.75054999e+02 -9.62522530e+00 7.49408599e-03 1.31899793e+02
1716.lowfreq: -2.5150 -1.3430 -0.0010 0.0015 0.0016 3.5150 13.5944 13.9868 16.8632
frequency: 13.5227 13.9805 16.8594 25.9785 32.0048 35.0308 43.9530 56.4703 63.1125 66.0216 71.0671 85.9516 90.4091 108.7123 114.5672 119.5143 134.8206 149.7769 181.9545 199.4169 209.5875 211.6394 242.9003 256.2332 283.4194 305.2614 314.1091 331.5023 342.6724 365.4668 381.4896 404.4253 409.7416 409.9470 418.7455 434.8057 453.0323 469.1562 485.6752 488.8547 522.4160 558.9545 598.8784 627.5709 639.5129 683.0553 683.1250 694.9389 702.0684 703.1107 726.0648 737.8044 744.4150 745.0610 780.6281 783.6531 790.5809 793.2548 827.2805 832.2570 834.7032 841.7040 850.7952 852.3864 853.1256 870.5791 919.9500 921.0463 952.5278 954.9577 984.3230 985.6367 990.0648 1008.3877 1025.9785 1041.5877 1042.3229 1052.8200 1052.8930 1092.5672 1093.4074 1134.7060 1135.0094 1197.5809 1207.6034 1209.1494 1209.3911 1236.6411 1237.6534 1266.3697 1267.3122 1268.7795 1273.6034 1299.3617 1308.2136 1317.3179 1324.1306 1324.3711 1352.1669 1358.0633 1359.8916 1373.2291 1379.0008 1379.9917 1423.0847 1425.4658 1438.7881 1438.8239 1455.9170 1455.9241 1493.3814 1507.6844 1520.7101 1533.5003 1581.2587 1591.4121 1619.5563 1628.3833 1655.0238 1658.2007 3047.3035 3047.3061 3070.1912 3070.1990 3119.5080 3120.7026 3121.4932 3121.4951 3140.7884 3146.0128 3149.7469 3154.0610 3159.8995 3159.9067 3193.1951 3193.4629 3435.6051 3435.7530
redmass: 9.0473 12.4673 11.3960 8.2064 11.2269 5.8912 5.7329 6.6916 3.9357 2.6637 3.5920 4.8984 7.7064 7.2164 10.0018 8.0268 7.1911 6.6030 6.4881 9.6538 8.7200 8.4191 8.6762 10.0670 5.9389 6.2590 4.6446 2.8915 4.0530 7.7846 7.4081 6.2789 2.9661 3.6603 4.6007 4.9815 10.2748 9.9823 8.2929 9.5833 2.8777 2.3248 7.4076 7.1482 7.0598 7.0712 6.9800 5.4339 6.6015 5.8477 3.5964 2.0582 2.6842 2.4113 1.2161 1.2577 2.2257 2.3189 5.2937 2.4694 1.4147 1.8537 1.6175 4.5728 3.0629 1.7400 2.8602 2.8573 1.3643 1.3957 1.3557 1.3414 5.6990 3.0355 2.6623 2.1381 2.0200 2.5395 2.4812 3.6403 3.2811 1.3148 1.5073 1.1117 1.1859 1.9088 1.8073 2.4413 2.4856 1.5201 1.1750 1.7190 2.1136 3.6407 1.4688 1.3306 1.2437 1.2259 2.2630 1.3176 1.5231 8.8441 6.7021 6.5667 3.2595 4.3591 1.1201 1.1257 1.0927 1.0928 2.3173 2.1495 2.2182 3.2850 3.6999 4.9445 5.8605 6.2251 8.9003 9.3105 1.0591 1.0591 1.0558 1.0558 1.0884 1.0889 1.1049 1.1049 1.0908 1.0898 1.0956 1.0946 1.1128 1.1128 1.0946 1.0947 1.0763 1.0763
irintensity: 0.0044 0.0457 0.1649 0.0569 0.0287 0.6280 0.1058 0.0606 0.1306 1.2165 1.4078 0.1275 2.8480 10.9797 0.0628 0.8822 11.9691 1.0585 0.0450 19.7913 33.4051 0.3303 3.0896 0.9023 5.0771 2.5176 0.4494 4.3364 22.3124 2.6592 40.0831 1.5332 1.5360 1.8142 3.3891 2.9937 7.4745 0.4894 14.6571 10.1135 42.3745 4.6782 9.8292 1.0657 0.0035 6.9550 25.8363 9.7774 138.0287 12.9921 4.9022 0.7391 0.3126 0.7844 52.3894 11.5776 297.0697 48.4403 0.4603 6.1121 186.5318 0.5568 55.3121 43.5396 50.9888 2.0343 330.3741 70.2433 6.2405 0.0183 4.7007 0.3246 11.0464 1.2929 15.9933 61.9712 68.8935 31.2287 2.7827 29.9030 71.1211 3.2740 13.6397 15.5900 1.8548 0.2989 6.5119 92.2271 9.3298 3.6397 5.2717 2.8626 5.1922 1.6752 2.4514 24.9724 11.5000 70.7830 3.8370 28.8625 4.0318 393.5668 168.3906 88.8030 133.9022 12.5298 20.7910 43.5347 2.6919 16.8791 94.5621 22.9940 1470.0938 3.6576 8.4476 152.7342 4.0964 39.5694 293.7124 334.2639 3.2834 0.5435 10.4258 15.6751 39.7665 3.2543 1.0679 1.6261 10.6727 13.9573 3.4230 11.1827 3.2134 2.5130 3.5932 0.4809 107.0661 53.1394
temp: 298.150 k
press: 1.00000 atm
elementType: 17 17 8 8 8 8 7 7 7 7 7 7 6 6 6 6 6 6 6 6 6 6 6 6 6 6 6 6 6 6 1 1 1 1 1 1 1 1 1 1 1 1 1 1 1 1 1 1
symmnumber: 1
zpe: 920953.9 jmol-1
zpe.correction: 0.350773 hartree
zpe.thermalcorrener: 0.379913 hartree
zpe.thermalcorrenthalpy: 0.380857 hartree
zpe.thermalcorrgfe: 0.283717 hartree
zpe.sumelectzpe: -2243.996150 hartree
zpe.sumelectthermal: -2243.967009 hartree
zpe.sumelectthermalent: -2243.966065 hartree
zpe.sumelectthermalfe: -2244.063205 hartree
dipole: 0.0000 -3.2227 0.0003
dipole: 3.2227
quadrupole: -257.0808 -195.8154 -187.5049
quadrupole: 0.0007 1.3122 -0.0006
quadrupole: -43.6138 17.6516 25.9622 0.0007 1.3122 -0.0006
hfenergy: -2244.3469227 hartree
pointgroup: C01 [X(C18H18Cl2N6O4)]
dipole: 0.0000192 -1.2679033 0.0001522 debye
polarizability: 662.4733367|0.0008581|275.0549994|-7.7921767|0.005132|131.8396189 unknown
InChI: InChI=1S/C18H18Cl2N6O4/c19-9-11-25(23-29)17(27)21-15-5-1-13(2-6-15)14-3-7-16(8-4-14)22-18(28)26(24-30)12-10-20/h1-8,21-22H,9-12H2
charge 0 multiplicity 1
48 atoms
Cl 10.174089 2.85959 0.292396
Cl -10.173924 2.859652 -0.292777
O  5.670229 1.561462 -0.651999
O  -5.670302 1.561342 0.652212
O  8.767573 -1.741783 0.192868
O  -8.767571 -1.74178 -0.193388
N  5.025803 -0.651778 -0.097477
N  -5.025834 -0.651867 0.097612
N  7.311769 -0.072222 -0.266835
N  -7.311812 -0.072305 0.266765
N  7.541261 -1.408939 0.093568
N  -7.541269 -1.408979 -0.093821
C  0.743481 -0.582844 -0.018127
C  -0.743513 -0.582858 0.01827
C  3.605615 -0.574518 -0.086751
C  -3.605648 -0.574582 0.08689
C  1.490137 -1.756329 0.283627
C  -1.490151 -1.756319 -0.283619
C  1.476312 0.588467 -0.35512
C  -1.476362 0.588404 0.355397
C  2.89464 -1.756941 0.25054
C  -2.894654 -1.756955 -0.250536
C  2.883147 0.608494 -0.392449
C  -2.883198 0.608406 0.392726
C  5.919053 0.361221 -0.359845
C  -5.919101 0.361089 0.360086
C  8.40331 0.887906 -0.546049
C  -8.403382 0.88783 0.545843
C  8.759274 1.692647 0.715428
C  -8.759047 1.692718 -0.715625
H  0.969067 -2.672749 0.580628
H  -0.969067 -2.672698 -0.580722
H  0.937316 1.502668 -0.626504
H  -0.93738 1.50258 0.62689
H  3.443456 -2.674028 0.498707
H  -3.443456 -2.674023 -0.498807
H  3.421312 1.519061 -0.661839
H  -3.421376 1.518933 0.662224
H  5.458173 -1.558736 0.123254
H  -5.458189 -1.558805 -0.123232
H  8.062379 1.567272 -1.342034
H  9.27492 0.303964 -0.8865
H  -8.062603 1.567099 1.341976
H  -9.275085 0.303878 0.886041
H  7.925976 2.330007 1.042438
H  9.126651 1.054196 1.531511
H  -7.92566 2.330091 -1.042382
H  -9.126261 1.054366 -1.531858
