program: Gaussian 09
title: 000262450
version: EM64L-G09RevD.01
frameworkgroup: C1[X(C18H14N2O)]
method: RPBEPBE
basis: SDD
operation: Freq
keyword: #p
keyword: freq=noraman
keyword: PBEPBE/SDD
title: #p freq=noraman PBEPBE/SDD
converged: YES YES NO NO
title: Mulliken charges:
elementType: O N N C C C C C C C C C C C C C C C C C C H H H H H H H H H H H H H H
charge: -0.267679 0.016441 0.009381 0.072377 -0.405726 0.350637 0.309620 -0.137982 0.105467 0.095629 -0.705731 -0.371341 -0.344024 -0.357274 -0.356148 -0.284232 -0.285130 -0.163920 -0.192120 -0.223071 -0.223383 0.200391 0.232069 0.300272 0.234870 0.238126 0.221307 0.223607 0.239474 0.264122 0.262965 0.232345 0.234868 0.237340 0.236456
chargesum: 0.00000
title: Mulliken charges with hydrogens summed into heavy atoms:
elementType: O N N C C C C C C C C C C C C C C C C C C
charge: -0.267679 0.016441 0.009381 0.072377 0.026733 0.350637 0.309620 0.162290 0.105467 0.095629 -0.011428 -0.147734 -0.104551 -0.093152 -0.093183 -0.051888 -0.050262 -0.163920 -0.192120 0.014269 0.013073
polarizability: 2.54629382e+02 -2.00266294e+00 1.99418046e+02 7.20800031e+00 1.92408865e+01 1.34040549e+02
1716.lowfreq: -10.2620 -0.0008 -0.0003 0.0005 4.0164 7.1239 34.1723 49.1545 74.9920
frequency: 34.0029 49.1319 74.9782 76.2381 103.4491 115.9373 124.4116 135.7531 177.1643 199.3784 223.2437 238.2009 257.8971 288.5814 321.4107 328.0601 358.4898 366.5987 374.1609 413.6993 439.9677 461.9535 473.0858 510.8844 532.2031 538.8981 561.1323 565.5287 608.9156 632.0502 658.8127 684.6896 726.8290 736.9891 760.7981 766.8992 772.1782 786.3493 845.7517 860.8598 867.2075 879.1512 906.5491 924.6324 946.2837 949.7308 959.4511 984.0589 986.2619 1024.8898 1035.5386 1038.0647 1058.3909 1086.9610 1089.4629 1101.9519 1126.9261 1164.7585 1171.5522 1178.2471 1189.0816 1207.8323 1233.7226 1238.9958 1264.4321 1269.6393 1286.5708 1318.6788 1328.8818 1380.9086 1390.4709 1394.3118 1435.1178 1447.6471 1471.9587 1474.5407 1475.1416 1483.2889 1488.8813 1577.6967 1600.7976 1609.6061 1630.6569 2198.1806 2208.7945 2987.9193 2989.3016 2992.0450 3045.8025 3085.6243 3090.1702 3116.5715 3139.9050 3144.0262 3150.9621 3161.0208 3164.6641 3176.1130 3177.1418
redmass: 6.9720 7.1418 5.5615 5.4714 2.8991 4.3654 8.1512 4.9179 5.6441 1.3741 3.4511 4.8837 5.2864 3.6531 4.3868 2.5682 6.1341 7.7927 5.8890 5.2467 5.6696 4.7835 3.1712 4.0485 4.1852 4.0589 5.3846 12.2981 6.1730 5.7341 5.4376 5.0385 3.5225 3.4620 1.4315 1.2709 1.9858 2.7435 2.6894 2.1024 1.4784 3.0744 3.3476 3.0866 1.9676 1.4212 2.4637 1.3182 1.3218 2.6415 2.1209 2.2761 3.6417 2.5016 2.3584 1.6498 1.8496 1.7503 1.1016 1.2074 1.9420 2.1714 2.1023 2.0603 1.3774 1.3797 1.4795 1.6809 1.3881 10.5414 6.5185 1.2899 2.4295 2.5026 2.0027 1.1456 1.2285 1.7362 1.1591 6.6506 7.4231 6.7914 7.3104 12.5733 12.5746 1.0639 1.0517 1.0621 1.0976 1.0994 1.1007 1.0876 1.0855 1.0881 1.0899 1.0939 1.0946 1.0998 1.1003
irintensity: 0.9051 0.5493 0.8902 2.3639 1.2338 0.6449 2.9162 2.5020 0.4025 0.2400 1.7197 2.0286 0.8790 0.1662 0.6404 0.0276 0.3437 0.0410 0.7300 0.4780 1.1313 3.9213 0.1803 6.0029 2.9009 1.2199 1.4020 0.4188 2.6990 4.7528 12.0928 9.3189 2.0911 2.5422 146.8616 5.5744 29.4658 4.9258 1.9669 11.0799 1.4877 20.1291 7.1478 6.5875 5.2425 0.0171 0.1507 0.1711 0.1289 1.2387 6.8134 1.5830 0.1333 10.5494 31.5024 1.7939 22.5076 8.8138 0.5872 0.2984 4.4203 10.6051 124.1463 96.8999 7.1878 40.2583 0.0889 16.8153 1.9733 28.8033 2.5587 14.6438 141.4422 15.4657 120.5859 1.6283 10.1127 2.8993 19.0222 29.9462 8.3306 25.5337 1.4564 4.7654 2.3691 13.7611 17.4489 21.3896 12.3616 30.5435 30.9448 9.5467 0.4115 7.5257 10.5903 16.0344 11.9884 15.7425 10.4009
temp: 298.150 k
press: 1.00000 atm
elementType: 8 7 7 6 6 6 6 6 6 6 6 6 6 6 6 6 6 6 6 6 6 1 1 1 1 1 1 1 1 1 1 1 1 1 1
symmnumber: 1
zpe: 703958.9 jmol-1
zpe.correction: 0.268124 hartree
zpe.thermalcorrener: 0.286107 hartree
zpe.thermalcorrenthalpy: 0.287051 hartree
zpe.thermalcorrgfe: 0.222414 hartree
zpe.sumelectzpe: -877.552433 hartree
zpe.sumelectthermal: -877.534450 hartree
zpe.sumelectthermalent: -877.533506 hartree
zpe.sumelectthermalfe: -877.598143 hartree
dipole: -2.6130 -0.6830 3.8410
dipole: 4.6955
quadrupole: -111.5627 -119.9622 -135.9726
quadrupole: -13.0779 3.3010 5.0577
quadrupole: 10.9365 2.5369 -13.4734 -13.0779 3.3010 5.0577
hfenergy: -877.820557 hartree
pointgroup: C01 [X(C18H14N2O1)]
dipole: 1.054093 -0.449552 -1.4489573 debye
polarizability: 254.214608|5.5616721|192.6888827|8.5315901|-27.6435453|141.1844865 unknown
InChI: InChI=1S/C18H14N2O/c1-2-18(13(11-19)12-20)14-7-3-5-9-16(14)21-17-10-6-4-8-15(17)18/h3-10,13H,2H2,1H3
charge 0 multiplicity 1
35 atoms
O  0.696312 -2.003646 0.609463
N  -0.195381 1.09751 3.003129
N  -2.578176 3.247693 -0.026699
C  -0.062903 0.651913 -0.558008
C  -0.217765 1.195014 -2.019411
C  1.384948 0.201705 -0.289105
C  -1.059966 -0.484241 -0.277984
C  -0.331666 1.886178 0.455132
C  1.684356 -1.058644 0.281259
C  -0.647664 -1.713745 0.292618
C  0.112281 0.143983 -3.0981
C  2.482628 1.054597 -0.57826
C  -2.443501 -0.343611 -0.567297
C  3.009458 -1.461136 0.559962
C  -1.556299 -2.754925 0.579549
C  3.811756 0.674416 -0.309924
C  -3.368144 -1.368867 -0.286625
C  -0.267354 1.452393 1.868106
C  -1.587807 2.623529 0.198828
C  4.075533 -0.592769 0.266069
C  -2.92231 -2.581212 0.292865
H  0.436468 2.079018 -2.151075
H  -1.251959 1.557233 -2.163738
H  0.498587 2.603698 0.290564
H  1.159478 -0.197804 -3.021401
H  -0.544296 -0.739141 -3.006344
H  -0.033572 0.572539 -4.105604
H  2.299547 2.036037 -1.033175
H  -2.811476 0.585159 -1.014398
H  3.173152 -2.446761 1.00511
H  -1.171184 -3.677543 1.023233
H  4.634379 1.357351 -0.54424
H  -4.428268 -1.221498 -0.515224
H  5.103778 -0.899279 0.484044
H  -3.632769 -3.383442 0.517579
