program: Gaussian 09
title: 000026634
version: EM64L-G09RevD.01
frameworkgroup: C1[X(C13H18N2O)]
method: RPBEPBE
basis: SDD
operation: Freq
keyword: #p
keyword: freq=noraman
keyword: PBEPBE/SDD
title: #p freq=noraman PBEPBE/SDD
converged: YES YES NO NO
title: Mulliken charges:
elementType: O N N C C C C C C C C C C C C C H H H H H H H H H H H H H H H H H H
charge: -0.281793 -0.401957 -0.538601 -0.067341 -0.447674 -0.589721 -0.546744 0.248683 0.271760 -0.401096 -0.374719 0.216814 -0.250595 -0.245586 -0.249011 -0.672342 0.266621 0.251458 0.212787 0.233691 0.232686 0.230351 0.229460 0.312142 0.234221 0.233800 0.211872 0.228609 0.228465 0.245054 0.230216 0.199089 0.266105 0.283298
chargesum: 0.00000
title: Mulliken charges with hydrogens summed into heavy atoms:
elementType: O N N C C C C C C C C C C C C C
charge: -0.281793 -0.089815 0.010802 0.199279 0.016571 -0.123344 -0.086933 0.248683 0.271760 -0.166875 -0.140920 0.216814 -0.038723 -0.016977 -0.020546 0.002017
polarizability: 1.81234775e+02 -2.16531697e+01 1.30173048e+02 -1.05250984e+01 -6.78692353e+00 1.40738516e+02
1716.lowfreq: -14.0997 -5.8343 -0.0009 -0.0009 -0.0008 2.4383 19.4479 32.5883 43.4592
frequency: 18.8451 32.4676 43.3606 57.3164 125.9711 135.8884 183.8538 231.1175 233.4963 248.6773 259.3184 271.6879 311.0346 320.4540 365.3724 401.7145 430.7163 463.3957 482.8460 503.4062 526.4554 568.6997 583.5998 652.6118 688.2982 708.6543 717.3051 721.7560 755.0589 760.8171 800.2947 833.5186 854.9697 880.7025 889.8758 928.7708 929.7686 954.8028 980.5589 988.5377 995.2497 1003.2505 1036.4463 1060.5378 1084.9474 1098.8373 1115.0662 1138.5735 1154.7677 1174.0086 1185.4086 1188.4682 1193.4627 1220.2703 1242.5296 1243.9914 1255.9755 1290.5869 1300.1024 1328.0568 1341.6956 1345.8329 1361.1154 1364.1893 1381.0362 1383.4023 1440.7872 1447.8716 1454.5729 1460.9418 1469.7038 1471.8995 1478.2692 1488.1114 1589.1472 1606.1045 1613.6162 1651.7986 2962.7598 2975.6073 2984.4737 2989.2158 2993.9974 3026.0301 3028.7153 3038.5316 3068.5328 3080.6628 3102.8284 3109.3846 3113.3685 3136.1481 3158.7425 3413.1859 3526.3122 3534.3190
redmass: 3.1519 4.5517 6.2958 3.6043 3.6158 3.2412 3.5050 1.1989 2.9275 1.4433 2.6687 2.3680 2.1596 3.5256 2.5330 2.8236 2.6970 3.3012 3.0158 4.1455 3.6281 1.3707 3.2190 2.7425 2.3667 3.6179 4.1114 3.2645 1.3898 2.0236 2.6923 3.2840 1.7227 1.7737 2.2854 1.9320 2.5481 1.6322 1.7673 1.3237 1.5140 2.2432 2.4135 1.6588 2.3333 1.6544 1.8012 2.3450 1.1358 1.0645 1.4703 1.6322 2.1322 2.0363 1.5941 1.5456 1.5894 1.5104 1.4040 1.6582 1.4435 1.7996 1.3108 1.3423 4.0740 1.2936 2.3645 1.1696 1.0926 1.0589 1.2479 1.3583 1.1770 2.2270 6.4942 6.4154 6.4111 1.0872 1.0653 1.0616 1.0367 1.0837 1.0652 1.0927 1.0993 1.0864 1.1003 1.0998 1.1003 1.0868 1.0893 1.0924 1.1004 1.0451 1.0775 1.0951
irintensity: 0.6568 0.5797 4.6439 0.3484 0.2404 0.3598 2.1125 4.4056 4.3112 54.5363 16.2361 7.9005 32.5446 0.9395 0.7328 5.9359 8.5660 3.4714 3.7345 0.5322 1.7733 54.4496 16.2405 16.6196 16.8642 30.6108 0.4446 5.6492 34.3715 279.1998 10.0165 1.3514 1.1935 3.2369 0.2457 6.5964 4.5552 5.0476 6.3124 0.0869 1.7952 7.2514 4.3772 33.9848 5.7928 1.2446 6.6416 10.6258 1.5038 0.1241 10.9969 13.3540 9.8774 1.9567 12.4104 27.7477 17.4315 3.8078 0.1088 4.0642 3.6509 2.8159 1.1075 7.9442 2.8955 17.6531 3.8146 15.3315 25.3683 28.0944 94.0383 113.2459 108.0796 15.1224 2.8739 153.3854 0.9502 39.1837 24.3396 20.7382 21.8142 29.1416 21.8314 31.8981 22.7620 27.5751 26.8339 38.8870 23.0997 16.6366 1.7377 26.3513 33.3065 2.0246 18.4154 2.0963
temp: 298.150 k
press: 1.00000 atm
elementType: 8 7 7 6 6 6 6 6 6 6 6 6 6 6 6 6 1 1 1 1 1 1 1 1 1 1 1 1 1 1 1 1 1 1
symmnumber: 1
zpe: 758130.0 jmol-1
zpe.correction: 0.288756 hartree
zpe.thermalcorrener: 0.304233 hartree
zpe.thermalcorrenthalpy: 0.305177 hartree
zpe.thermalcorrgfe: 0.244464 hartree
zpe.sumelectzpe: -689.729227 hartree
zpe.sumelectthermal: -689.713751 hartree
zpe.sumelectthermalent: -689.712806 hartree
zpe.sumelectthermalfe: -689.773520 hartree
dipole: 3.2230 -0.6587 -0.9120
dipole: 3.4137
quadrupole: -108.1865 -97.9547 -89.0038
quadrupole: -0.9278 0.8369 -4.3272
quadrupole: -9.8048 0.4270 9.3778 -0.9278 0.8369 -4.3272
hfenergy: -690.0179834 hartree
pointgroup: C01 [X(C13H18N2O1)]
dipole: -1.2681344 -0.2311334 0.3770931 debye
polarizability: 181.8849417|20.5943221|129.1570123|-10.913242|6.6795327|141.1043848 unknown
InChI: InChI=1S/C13H18N2O/c1-9(14)13(16)15-12-7-6-10-4-2-3-5-11(10)8-12/h2-5,9,12,15H,6-8,14H2,1H3
charge 0 multiplicity 1
34 atoms
O  3.244513 1.18047 -0.413163
N  1.243953 0.29668 0.380185
N  4.61245 -0.951419 1.041763
C  0.438795 1.498783 0.063925
C  0.008906 1.523645 -1.425871
C  -0.813994 1.544543 0.9612
C  -0.837543 0.283206 -1.782506
C  -1.867324 0.506505 0.571295
C  -1.898235 -0.059359 -0.73611
C  -2.851803 0.121122 1.5172
C  -2.923289 -0.986518 -1.057256
C  2.592684 0.213361 0.097061
C  3.282194 -1.139768 0.429113
C  -3.866457 -0.800967 1.186689
C  -3.902998 -1.358465 -0.113478
C  3.429578 -1.959409 -0.874265
H  1.086068 2.371841 0.263009
H  0.906217 1.576665 -2.066949
H  -0.576626 2.448601 -1.594995
H  -1.253808 2.558286 0.874287
H  -0.52862 1.420558 2.023705
H  -0.162712 -0.589707 -1.902572
H  -1.320451 0.426748 -2.767898
H  0.760201 -0.516294 0.769832
H  -2.820698 0.556541 2.524395
H  -2.949248 -1.419795 -2.065508
H  2.656798 -1.711673 1.143697
H  -4.618942 -1.082904 1.931483
H  -4.686474 -2.074284 -0.386144
H  3.929824 -2.915746 -0.648131
H  4.047029 -1.401271 -1.601688
H  2.448417 -2.164065 -1.340945
H  4.562712 -0.548856 1.986539
H  5.205083 -0.361553 0.440699
