program: Gaussian 09
title: 000262400
version: EM64L-G09RevD.01
frameworkgroup: C1[X(C7H7NO2S)]
method: RPBEPBE
basis: SDD
operation: Freq
keyword: #p
keyword: freq=noraman
keyword: PBEPBE/SDD
title: #p freq=noraman PBEPBE/SDD
converged: YES YES NO NO
title: Mulliken charges:
elementType: S O O N C C C C C C C H H H H H H H
charge: 0.305892 -0.447476 -0.234219 0.023161 0.335181 -0.469835 -0.230625 -0.186242 -0.341116 0.116969 -0.829395 0.290620 0.238388 0.246920 0.277796 0.277857 0.238739 0.387385
chargesum: 0.00000
title: Mulliken charges with hydrogens summed into heavy atoms:
elementType: S O O N C C C C C C C
charge: 0.305892 -0.060091 -0.234219 0.023161 0.335181 -0.469835 0.059995 0.052146 -0.094197 0.116969 -0.035002
polarizability: 1.45514070e+02 7.75518601e+00 1.36274177e+02 -3.75103728e-03 8.82440102e-03 4.52761937e+01
1716.lowfreq: -9.8194 -9.3202 -0.0014 -0.0007 -0.0006 4.3610 53.0557 105.5436 111.6147
frequency: 53.0548 105.5410 111.6146 148.9476 163.7986 214.8430 220.1055 307.1162 344.7348 425.7871 448.8219 486.5195 505.9189 581.9781 599.8407 645.0088 659.4317 698.7295 761.6850 782.1955 823.7088 959.3783 970.8984 972.5687 984.7744 995.5054 1048.0711 1076.6665 1128.9996 1163.4373 1229.1897 1314.6550 1326.1396 1338.6494 1397.4556 1419.5848 1432.1368 1446.2336 1528.6724 1574.3154 1632.7584 3023.1377 3132.9393 3146.6957 3159.4830 3168.0325 3187.9287 3532.8660
redmass: 6.3834 4.8562 4.7536 1.0756 6.8713 4.9827 3.6745 6.4462 11.0053 3.8050 8.0862 3.3718 7.3137 1.2195 5.4217 6.5561 6.9981 6.2036 2.7281 7.1438 1.7140 1.4114 1.1856 4.1341 1.4506 1.3868 2.8983 2.9458 1.9706 1.5372 1.7793 3.1477 4.2220 1.1410 2.3419 2.1767 1.0534 1.0701 5.6996 6.1000 8.6437 1.0285 1.0900 1.1035 1.1054 1.0916 1.0988 1.0643
irintensity: 3.1690 0.1717 3.0573 0.0557 3.8288 3.2158 2.4260 5.0339 8.3980 3.4049 2.3567 2.2719 13.2085 144.1694 29.4438 13.6660 15.6803 27.6766 38.2416 17.9456 25.8294 0.0407 7.3106 207.3971 27.7498 1.0806 49.0957 95.4377 67.0472 63.9759 6.4109 72.1835 31.7570 6.8137 122.9031 41.9581 13.5252 14.3397 81.2891 51.0308 230.4752 24.5059 17.4478 8.6497 11.5959 9.4339 8.1568 55.4367
temp: 298.150 k
press: 1.00000 atm
elementType: 16 8 8 7 6 6 6 6 6 6 6 1 1 1 1 1 1 1
symmnumber: 1
zpe: 337230.6 jmol-1
zpe.correction: 0.128444 hartree
zpe.thermalcorrener: 0.138997 hartree
zpe.thermalcorrenthalpy: 0.139941 hartree
zpe.thermalcorrgfe: 0.091686 hartree
zpe.sumelectzpe: -873.404614 hartree
zpe.sumelectthermal: -873.394061 hartree
zpe.sumelectthermalent: -873.393117 hartree
zpe.sumelectthermalfe: -873.441373 hartree
dipole: 1.0980 2.5991 0.0028
dipole: 2.8215
quadrupole: -58.3904 -67.9368 -73.1234
quadrupole: -0.7226 -0.0071 -0.0028
quadrupole: 8.0931 -1.4533 -6.6399 -0.7226 -0.0071 -0.0028
hfenergy: -873.5330583 hartree
pointgroup: C01 [X(C7H7N1O2S1)]
dipole: 0.0476019 1.1053953 -0.0897008 debye
dipolederiv: 0.2328625 0.1122296 -0.0028744 0.4377507 -0.6007335 0.0563541 -0.0291108 0.0487791 -0.0427261 -1.3723579 0.3743842 -0.0536009 0.5013758 -0.4104616 0.0107271 -0.0634462 0.0073994 -0.4327574 -0.782912 -0.155402 0.0010434 -0.1064666 -0.8568216 0.0415456 -0.0031781 0.0410811 -0.3114251 -0.2379157 -0.4177113 0.0326362 0.1994369 -1.0050906 0.0721967 -0.0178804 0.0575053 -0.1837828 -0.6757907 0.1639088 -0.0313263 -0.3321538 -0.5728557 0.0428037 0.008868 0.0548397 0.049658 0.1420937 -0.0551226 0.0092688 -0.5338248 1.3042319 -0.1228582 0.0482778 -0.1115216 -0.0311807 0.21469 0.054954 0.0026534 0.3135243 0.3079846 -0.0233398 -0.0184915 -0.0298112 -0.0725901 -0.5843321 -0.1080607 -0.0017634 0.0125266 -0.0649624 -0.0070802 -0.0112778 -0.0099218 -0.1574155 0.5110022 0.1123265 0.0042882 -0.2276168 0.4834255 -0.0482557 0.0318723 -0.0399617 -0.0357908 2.0216164 -0.0078009 0.0447166 0.0516287 1.121591 -0.0705088 0.0395682 -0.0723032 0.239602 0.0816547 -0.0575221 0.0057478 -0.1089193 0.0905465 -0.0059456 0.0100758 -0.0047645 0.047355 0.0400279 0.0574709 -0.0074717 0.055728 0.1014291 0.0056739 -0.007315 0.005712 0.153898 0.0906437 0.0190205 -0.0034982 -0.0019958 -0.1020971 0.0220438 -0.0017392 0.0224954 0.1689612 -0.0323835 -0.1229151 0.0059995 -0.0759529 -0.0082999 0.009542 0.0020904 0.008326 0.1313271 -0.0298916 0.0235261 -0.0570596 -0.0673485 0.0737556 -0.0916953 -0.0426017 -0.0605671 -0.0139503 -0.034286 0.0297089 0.0519478 -0.0635562 0.0954015 0.0715074 0.0524342 0.0445352 -0.0306696 0.0586343 0.0478855 -0.0053757 0.0863792 -0.1120525 0.0207385 -0.008514 0.0198804 0.1211605 0.3566442 -0.0708801 0.0046685 -0.1405156 0.1550092 0.0165508 0.010368 0.0182977 0.4003264 unknown
polarizability: 137.7620182|-8.273949|143.2913449|2.9249681|-8.1665721|46.0110775 unknown
InChI: InChI=1S/C7H7NO2S/c1-11-6-5(7(9)10)3-2-4-8-6/h2-4,9H,1H3
charge 0 multiplicity 1
18 atoms
S  0.898642 -2.107615 0.353151
O  -3.089445 0.162703 0.069577
O  -1.935371 -1.842927 0.261012
N  1.746353 0.475079 0.163115
C  -0.689388 0.252462 0.121333
C  0.631437 -0.310847 0.199631
C  -0.804449 1.662449 0.004183
C  0.349838 2.466982 -0.03279
C  1.604933 1.82227 0.050018
C  -1.902507 -0.591628 0.159499
C  2.784954 -2.13984 0.398896
H  -1.805533 2.096773 -0.055639
H  0.287465 3.55466 -0.122265
H  2.5380 2.397262 0.025971
H  3.151943 -1.569501 1.262793
H  3.192688 -1.711871 -0.526777
H  3.040858 -3.207738 0.489764
H  -3.860419 -0.464572 0.10173
