program: Gaussian 09
title: 000262421
version: EM64L-G09RevD.01
frameworkgroup: C1[X(C14H13ClN4O3)]
method: RPBEPBE
basis: SDD
operation: Freq
keyword: #p
keyword: freq=noraman
keyword: PBEPBE/SDD
title: #p freq=noraman PBEPBE/SDD
converged: YES YES NO NO
title: Mulliken charges:
elementType: Cl O O O N N N N C C C C C C C C C C C C C C H H H H H H H H H H H H H
charge: -0.052344 -0.411658 -0.260965 -0.258911 -0.169056 -0.408703 -0.218736 -0.081225 0.102598 0.094702 0.169234 -0.308926 0.124143 0.206630 0.394317 -0.616220 -0.597171 -0.361097 -0.365334 -0.202137 -0.209369 -0.110214 0.250953 0.343714 0.275766 0.248752 0.246879 0.268894 0.252744 0.253013 0.278649 0.240598 0.363448 0.258982 0.258049
chargesum: 0.00000
title: Mulliken charges with hydrogens summed into heavy atoms:
elementType: Cl O O O N N N N C C C C C C C C C C C C C C
charge: -0.052344 -0.048210 -0.260965 -0.258911 -0.169056 -0.064989 -0.218736 -0.081225 0.102598 0.094702 0.169234 -0.057972 0.124143 0.206630 0.394317 0.155177 0.177480 -0.082449 -0.124736 0.056845 0.048680 -0.110214
polarizability: 2.78611103e+02 -1.92695590e+01 1.68473201e+02 -2.08174902e+00 5.86238488e+00 1.55979067e+02
1716.lowfreq: -7.6091 -4.0291 -0.0009 0.0008 0.0018 1.6154 12.2219 19.4514 27.1231
frequency: 12.0741 19.2599 27.1123 77.5837 85.3320 87.3910 106.3752 111.1029 117.4955 128.7812 176.7375 186.8118 219.3185 244.8354 259.1028 287.6435 299.9381 312.3692 339.1839 360.3726 365.5951 390.2414 404.5553 416.4855 436.9406 447.7315 469.9622 484.5073 504.1909 555.8629 623.0343 632.9728 653.0442 665.2911 681.7949 704.5136 711.6383 723.4521 745.5525 764.4366 781.7447 819.7885 833.8346 857.6333 928.4722 950.2181 955.7450 970.0979 975.9061 1000.0799 1005.4355 1039.0470 1072.7607 1103.9809 1109.9636 1129.0736 1131.4070 1172.3873 1179.2283 1188.0943 1202.9655 1225.8760 1229.4408 1255.4380 1269.6473 1291.5854 1301.4183 1359.4388 1369.3680 1374.0303 1388.6612 1403.8059 1418.1528 1427.6927 1463.5021 1472.3720 1473.7252 1478.1175 1479.6726 1481.1056 1524.5854 1581.0533 1586.6334 1598.5759 1618.2437 1657.7473 3004.0039 3007.1330 3013.6514 3097.4503 3106.6969 3134.8517 3139.0920 3139.2865 3155.1177 3171.0127 3175.8543 3504.0625 3578.7373
redmass: 6.3241 3.9868 8.3364 4.9423 3.2854 1.2686 1.4760 4.9670 2.3580 5.6784 8.1011 5.4142 8.0748 5.8573 5.0705 4.2962 4.2085 5.8245 3.7949 6.5153 6.4172 7.3454 2.3096 1.9630 3.3758 4.9588 4.5103 6.9771 4.8140 6.1966 7.0454 5.6768 6.4033 4.7347 1.3528 9.9871 4.5940 6.4969 11.0276 4.9330 2.5870 3.3406 1.3275 2.2093 4.1818 2.2605 2.1582 3.8670 1.3647 4.2977 5.4582 3.0531 2.7430 4.0360 1.3445 1.3041 1.3004 1.6197 1.5284 1.8590 2.5819 2.3769 1.5974 2.1720 3.4097 1.3626 2.7334 1.5986 4.9995 5.0986 3.8302 2.5608 1.2893 1.2909 2.6128 1.0431 2.2734 1.0743 1.0796 1.4048 4.0077 8.4509 7.7991 6.1818 10.5397 10.4187 1.0839 1.0336 1.0327 1.1027 1.1022 1.0893 1.1011 1.1026 1.0885 1.0954 1.0971 1.0657 1.0823
irintensity: 0.2232 0.1411 0.1564 0.2421 0.9121 0.1089 2.2766 1.3800 2.9899 1.1500 1.0974 14.3636 1.7183 1.0225 19.6090 1.0923 2.4856 4.8332 9.0501 2.2066 23.2596 6.3863 41.6014 69.9317 120.8748 54.5082 4.3884 10.8587 19.6825 6.0064 0.5062 21.3592 3.2309 2.2749 109.6786 14.5091 4.5301 0.4010 8.0614 3.9686 46.6887 36.0608 4.3693 25.7135 5.8794 26.6945 25.8093 52.4520 1.1976 35.4248 26.0886 44.1668 38.8892 26.5854 2.8478 0.2541 0.1267 17.9097 7.7685 8.4908 106.9182 19.3299 15.7648 13.7595 24.0322 7.6982 92.6548 87.5925 33.7505 21.9539 7.4203 64.4833 52.9873 68.2570 72.6817 17.6946 80.5813 5.0242 19.4144 77.2377 89.7461 13.1271 7.8379 12.2287 618.2046 435.5746 13.1244 31.8138 25.9101 16.5481 15.5647 12.0164 0.3102 0.7374 0.1611 4.2079 1.9893 21.6399 87.0025
temp: 298.150 k
press: 1.00000 atm
elementType: 17 8 8 8 7 7 7 7 6 6 6 6 6 6 6 6 6 6 6 6 6 6 1 1 1 1 1 1 1 1 1 1 1 1 1
symmnumber: 1
zpe: 677118.2 jmol-1
zpe.correction: 0.257901 hartree
zpe.thermalcorrener: 0.278078 hartree
zpe.thermalcorrenthalpy: 0.279022 hartree
zpe.thermalcorrgfe: 0.206079 hartree
zpe.sumelectzpe: -1444.491284 hartree
zpe.sumelectthermal: -1444.471107 hartree
zpe.sumelectthermalent: -1444.470163 hartree
zpe.sumelectthermalfe: -1444.543106 hartree
dipole: -0.8852 0.7809 -0.6016
dipole: 1.3249
quadrupole: -154.5197 -136.3420 -137.2087
quadrupole: -1.5489 1.6860 1.0758
quadrupole: -11.8296 6.3482 5.4814 -1.5489 1.6860 1.0758
hfenergy: -1444.7491852 hartree
pointgroup: C01 [X(C14H13Cl1N4O3)]
dipole: 0.3582031 0.3224567 -0.1985222 debye
polarizability: 280.8746435|6.9453811|154.1387573|-9.0630596|1.7321642|168.0499708 unknown
InChI: InChI=1S/C14H13ClN4O3/c1-18-12-9(13(21)19(2)14(18)22)16-11(17-12)10(20)7-3-5-8(15)6-4-7/h3-6,10,16,20H,1-2H3
charge 0 multiplicity 1
35 atoms
Cl 6.27648 -1.342634 1.960496
O  1.80144 1.716365 -2.226836
O  -3.336016 1.495166 2.029866
O  -4.589779 -2.111028 -0.751488
N  -2.459476 -1.184982 -1.087688
N  -0.670746 1.473914 0.442237
N  -3.948214 -0.320121 0.618527
N  -0.274171 -0.01295 -1.228855
C  -1.813357 0.672409 0.344233
C  -1.539133 -0.2282 -0.695596
C  0.226993 1.031701 -0.513608
C  1.594585 1.613792 -0.775675
C  -3.046031 0.698675 1.085867
C  -3.71578 -1.258696 -0.430416
C  2.731014 0.831682 -0.090904
C  -2.151769 -2.1251 -2.183478
C  -5.269934 -0.42587 1.280261
C  4.038854 0.929738 -0.627426
C  2.520133 0.062029 1.078287
C  5.123447 0.270018 -0.009959
C  3.595442 -0.603759 1.709417
C  4.882648 -0.486502 1.153672
H  1.618006 2.664095 -0.426092
H  -0.560185 2.251267 1.094316
H  -3.013607 -2.79873 -2.294445
H  -1.244615 -2.703517 -1.941566
H  -1.981486 -1.571824 -3.122373
H  -5.307786 0.346992 2.061744
H  -5.392731 -1.428704 1.720414
H  -6.074738 -0.270626 0.5435
H  4.195926 1.513133 -1.53994
H  1.515802 -0.038268 1.505207
H  1.482087 0.862092 -2.626132
H  6.132661 0.341857 -0.425528
H  3.432634 -1.203618 2.609262
