program: Gaussian 09
title: 000262393
version: EM64L-G09RevD.01
frameworkgroup: C1[X(C6H10N4OS)]
method: RPBEPBE
basis: SDD
operation: Freq
keyword: #p
keyword: freq=noraman
keyword: PBEPBE/SDD
title: #p freq=noraman PBEPBE/SDD
converged: NO YES NO NO
title: Mulliken charges:
elementType: S O N N N N C C C C C C H H H H H H H H H H
charge: -0.018474 -0.284386 -0.120268 -0.125192 -0.662717 -0.663292 0.374573 -0.031916 -0.246377 0.174640 -0.630635 -0.608419 0.235454 0.277320 0.237867 0.271018 0.253243 0.253817 0.368109 0.336927 0.308520 0.300190
chargesum: 0.00000
title: Mulliken charges with hydrogens summed into heavy atoms:
elementType: S O N N N N C C C C C C
charge: -0.018474 -0.284386 -0.120268 -0.125192 0.042319 -0.054582 0.374573 -0.031916 -0.246377 0.174640 0.120005 0.169659
polarizability: 1.56203398e+02 -2.39375684e+00 1.39672824e+02 5.30518166e-01 -2.38550469e-02 5.80059615e+01
1716.lowfreq: -9.9144 -7.1158 -0.0014 0.0009 0.0011 8.7060 37.4718 62.6865 97.6577
frequency: 36.7983 62.6521 97.6567 160.9512 168.7090 178.3630 191.2315 282.0109 294.6157 304.7036 312.3531 333.0194 367.4553 376.5626 393.1580 405.9644 445.9934 530.2316 598.4907 610.3862 644.5566 671.4825 717.3997 740.5613 801.7641 828.3027 900.3794 1001.9888 1041.5664 1090.9559 1123.2318 1128.7385 1140.8256 1168.0214 1199.0164 1258.0843 1290.8975 1297.8480 1354.9343 1412.6133 1436.7464 1463.6401 1468.9885 1470.9068 1491.4392 1500.1470 1562.1879 1612.5788 1617.5023 1675.2561 2974.6353 3007.1123 3068.5071 3093.1129 3099.3054 3133.4073 3413.0872 3456.2088 3513.9279 3686.9912
redmass: 1.3732 3.9642 3.9198 1.3030 2.0145 1.4903 1.8498 5.2011 2.4867 3.7056 4.7334 3.2699 2.9635 1.9075 4.2206 3.6726 6.4477 6.2584 6.4833 8.6402 4.4950 3.3699 6.9053 1.2968 1.5765 3.3215 4.4495 3.3224 2.7328 1.9643 1.3088 1.3097 2.3798 1.4765 2.2325 4.3818 6.2538 4.3111 3.7916 1.2865 1.4380 1.2519 1.0437 1.0649 1.1915 1.6126 1.5611 8.7982 2.2172 1.5560 1.0340 1.0324 1.1033 1.0989 1.1016 1.1023 1.0464 1.0527 1.0940 1.0955
irintensity: 1.4219 0.0406 10.8541 20.3995 0.6885 0.0914 0.0602 5.6508 46.0296 17.9361 2.8797 3.7542 29.5397 91.4291 4.9655 13.6992 17.1792 0.8947 5.2594 0.5117 25.8036 1.6219 5.9843 144.4128 164.2668 21.9785 29.5591 4.4096 0.7662 206.7999 0.9588 0.4117 0.2818 9.8438 26.7009 36.5147 5.3102 276.2665 18.9687 48.8402 79.5729 6.4299 18.7209 30.1237 62.1311 186.7585 149.1948 155.0165 415.6420 280.8889 59.7660 18.8544 22.7250 7.7035 14.4305 2.1803 3.6957 98.5809 11.5875 69.0330
temp: 298.150 k
press: 1.00000 atm
elementType: 16 8 7 7 7 7 6 6 6 6 6 6 1 1 1 1 1 1 1 1 1 1
symmnumber: 1
zpe: 446866.0 jmol-1
zpe.correction: 0.170202 hartree
zpe.thermalcorrener: 0.182962 hartree
zpe.thermalcorrenthalpy: 0.183906 hartree
zpe.thermalcorrgfe: 0.131000 hartree
zpe.sumelectzpe: -926.047124 hartree
zpe.sumelectthermal: -926.034364 hartree
zpe.sumelectthermalent: -926.033420 hartree
zpe.sumelectthermalfe: -926.086326 hartree
dipole: 3.1297 4.9781 0.0958
dipole: 5.8810
quadrupole: -81.9444 -71.2590 -78.7708
quadrupole: 8.1494 1.0104 -0.3821
quadrupole: -4.6196 6.0658 -1.4461 8.1494 1.0104 -0.3821
hfenergy: -926.217326 hartree
pointgroup: C01 [X(C6H10N4O1S1)]
dipole: -1.3717643 -1.8632401 0.0079936 debye
dipolederiv: -0.9747106 0.1384066 0.0024976 0.1186589 -0.3481173 -0.0015415 -0.0013808 0.002267 -0.253501 -0.6471031 0.2622228 0.0033659 0.261589 -1.3718818 -0.0143268 0.0007809 -0.0044459 -0.3723088 -1.3979455 0.0798963 0.0098605 -0.3642858 -0.7146076 -0.0155846 -0.0158643 -0.0083787 -0.0959084 -1.2382932 0.4108387 0.005735 0.549977 -0.9049687 -0.0104988 0.0353416 -0.0014005 -0.1076724 -0.7370822 -0.5816076 -0.013826 -0.5045316 -1.1206456 -0.0033313 0.0138549 0.0741381 -0.6326692 -0.7574141 -0.026111 -0.0408754 -0.1396792 -0.3953623 -0.0670211 -0.0555312 -0.0600789 -0.1709442 1.1736715 0.1040709 0.0151281 0.3640694 1.4924987 0.0587837 0.003514 0.0743166 0.208399 0.3186956 -0.2029948 -0.0047849 -0.3125259 -1.0276583 0.0062111 -0.0612115 -0.0089446 -0.1995344 1.6997502 -0.1593386 -0.0020283 -0.0466861 0.8652311 0.0064542 0.0150367 0.0061658 -0.0646439 1.249915 -0.1020989 -0.0106844 -0.3303734 1.6706003 0.0166193 0.0210272 -0.0137007 0.2101543 -0.080644 -0.1977381 -0.0132541 -0.0572932 0.3838155 0.0134564 -0.0201756 0.0122644 0.2331477 0.0793106 0.1306598 0.0023343 0.1036168 0.2570466 0.0000397 -0.0090005 0.0063305 0.1757683 0.0817403 -0.0994098 0.099603 -0.0147541 -0.0393398 0.045606 0.0658589 0.0786506 -0.0319969 0.0491324 0.1755271 -0.0119526 -0.0162884 0.2466506 -0.0078961 -0.0072944 -0.0025731 0.125808 0.1028732 -0.063132 -0.0795598 -0.0038979 -0.0432154 -0.0469067 -0.0474555 -0.098065 -0.0691469 0.1495744 0.1742668 0.0002397 0.0148067 0.0283208 0.0002592 -0.0008911 -0.0015986 0.1312507 0.0237249 -0.0747421 0.0767341 0.0088984 0.0837013 -0.0467453 0.0639406 0.0077962 -0.0349511 0.0207225 -0.0727992 -0.0782662 0.0048831 0.0853296 0.0468739 -0.06384 -0.0071446 -0.0332137 0.2953466 0.0127323 -0.0048677 -0.0108177 0.2709011 -0.0111613 -0.0253672 -0.0326908 0.3463722 0.2193242 0.046614 0.0035962 0.0842539 0.23997 -0.0164807 -0.0016167 -0.053216 0.3548764 0.192147 0.0019882 0.0438183 0.0927725 0.1470784 0.1197434 0.0418068 0.0560272 0.2076914 0.1772642 0.0427485 -0.0028133 0.1976076 0.1946529 -0.0725528 0.0484671 -0.025719 0.073023 unknown
polarizability: 155.7589918|-3.5630895|140.0827294|-0.9035724|1.5749821|58.0404625 unknown
InChI: InChI=1S/C6H10N4OS/c1-9-4(8)3(7)5(11)10(2)6(9)12/h7-8H2,1-2H3
charge 0 multiplicity 1
22 atoms
S  3.078216 -0.510228 -0.002106
O  -0.981406 2.569426 0.047924
N  0.440397 -1.308424 -0.013175
N  0.835357 1.043647 0.012108
N  -1.808926 -2.144987 -0.078439
N  -2.897943 0.355861 0.037706
C  -0.94069 -1.081492 -0.021537
C  -1.462858 0.214994 0.040842
C  1.375181 -0.237869 0.000892
C  -0.591337 1.35923 0.040469
C  0.920833 -2.706653 -0.028185
C  1.762075 2.1984 0.011279
H  0.500906 -3.26406 0.828605
H  2.018077 -2.682385 0.057812
H  0.652342 -3.202264 -0.979604
H  1.140668 3.105808 0.017175
H  2.403786 2.164848 -0.884591
H  2.413445 2.160106 0.900009
H  -2.792217 -1.859014 -0.141432
H  -1.5213 -3.110671 -0.193764
H  -3.209346 1.073202 -0.630215
H  -3.283958 0.566724 0.968624
