program: Gaussian 09
title: 000262435
version: EM64L-G09RevD.01
frameworkgroup: C1[X(C26H20F4N6O2)]
method: RPBEPBE
basis: SDD
operation: Freq
keyword: #p
keyword: freq=noraman
keyword: PBEPBE/SDD
title: #p freq=noraman PBEPBE/SDD
converged: YES YES NO NO
title: Mulliken charges:
elementType: F F F F O O N N N N N N C C C C C C C C C C C C C C C C C C C C C C C C C C H H H H H H H H H H H H H H H H H H H H
charge: -0.128087 -0.169754 -0.169189 -0.127954 -0.211268 -0.211397 -0.444688 -0.444642 -0.121294 -0.121252 -0.451607 -0.452264 -0.391152 -0.391189 0.124003 0.123892 -0.477338 -0.477296 0.381903 0.382001 0.511006 0.511074 -0.378098 -0.377972 -0.357982 -0.358003 -0.342911 -0.343056 -0.467303 -0.467563 0.012083 0.012835 0.151571 0.151546 0.068130 0.110509 0.110276 0.067880 0.221555 0.229487 0.229474 0.221536 0.231362 0.230912 0.230912 0.231348 0.290846 0.290832 0.281806 0.281678 0.228953 0.228983 0.306647 0.306555 0.225421 0.225402 0.335299 0.335539
chargesum: 0.00000
title: Mulliken charges with hydrogens summed into heavy atoms:
elementType: F F F F O O N N N N N N C C C C C C C C C C C C C C C C C C C C C C C C C C
charge: -0.128087 -0.169754 -0.169189 -0.127954 -0.211268 -0.211397 -0.153842 -0.153810 -0.121294 -0.121252 -0.116308 -0.116725 0.059891 0.059821 0.124003 0.123892 -0.015064 -0.015035 0.381903 0.382001 0.511006 0.511074 -0.096291 -0.096294 -0.129030 -0.129019 -0.036264 -0.036501 -0.241882 -0.242161 0.012083 0.012835 0.151571 0.151546 0.068130 0.110509 0.110276 0.067880
polarizability: 8.18339489e+02 -6.17465157e+00 2.86729156e+02 1.35795453e-01 5.53212624e-01 1.92600166e+02
1716.lowfreq: -3.0270 -1.4809 -0.0015 0.0010 0.0012 3.2091 8.5817 14.6981 19.2898
frequency: 8.5784 14.4452 19.2115 24.7779 31.9442 35.1253 46.8449 48.2147 61.5736 67.8581 82.8736 94.0253 95.6395 102.2461 108.3419 117.1341 130.6958 131.9575 143.4475 144.4693 173.2059 177.3215 187.0461 216.4610 218.3112 226.8495 289.9728 293.0606 299.5463 302.3404 309.9379 338.6643 342.6635 359.1498 359.3101 370.0353 386.9318 392.4534 396.7394 403.6704 412.6840 413.1042 423.6489 449.5823 451.5300 469.5113 475.7115 514.1928 521.1018 561.5520 606.4353 617.6156 629.8626 632.4631 649.6855 650.9128 652.5933 654.1465 659.2091 675.0529 717.8365 719.6876 726.0127 726.3779 745.9636 746.5082 765.8357 785.9299 804.6408 826.9605 827.8343 831.0967 831.3257 831.4422 849.2837 881.6142 881.9217 883.5222 883.6122 893.9263 924.7101 938.4236 938.5013 945.4882 945.9736 948.2999 948.3348 991.8125 1006.4223 1007.0387 1010.2501 1010.4074 1027.6798 1027.9957 1052.0022 1078.4041 1078.5124 1097.9315 1098.4055 1123.7361 1130.3651 1137.3545 1167.0332 1167.2416 1193.0213 1195.8147 1196.4001 1209.5003 1209.5720 1245.6109 1262.5566 1264.1921 1264.4076 1265.6489 1278.8265 1279.0036 1310.4485 1310.6567 1325.9981 1326.8989 1331.5615 1363.1519 1367.5199 1368.2423 1403.2873 1415.7968 1416.6691 1426.7589 1435.6519 1436.5250 1465.9407 1466.3144 1498.8754 1499.2709 1503.8327 1504.5367 1517.7793 1519.3218 1554.3171 1570.1683 1570.7973 1596.8404 1597.3499 1614.7822 1617.1358 1621.7242 1626.5593 1630.2767 2966.8478 2966.8756 2996.8108 2996.9065 3038.5811 3038.7693 3061.3787 3061.5440 3116.0277 3116.0436 3148.2064 3148.5680 3164.1705 3164.4377 3201.1647 3201.2824 3517.7394 3517.8102 3577.4908 3577.6021
redmass: 7.3249 6.8884 4.0306 5.3491 6.8278 7.0372 4.8812 4.9485 4.7708 4.4016 6.0416 5.8544 6.3153 6.0954 6.6009 13.8001 3.1030 2.7400 3.8666 4.0634 9.0278 8.0534 7.1342 8.9441 4.7610 5.2856 15.5441 13.5409 14.9622 9.1651 8.1465 6.9790 6.1023 4.7068 4.9257 5.6108 11.7700 1.8537 1.6850 4.4992 2.7151 2.6735 12.4864 3.8532 3.3461 7.0476 12.8548 3.1524 2.8197 7.2595 7.7162 7.6042 6.8409 6.7441 2.3377 3.7465 2.2190 8.4446 1.3413 3.7672 9.5511 9.0647 3.7772 3.8801 4.1354 4.1019 8.9456 9.9685 10.7920 1.5149 1.4472 1.4124 5.2146 1.4171 6.0863 2.8862 2.9288 1.9871 1.9399 8.7174 12.4226 3.3981 3.3736 4.0245 4.1536 1.5619 1.5666 9.3978 2.8544 2.7562 1.4042 1.4094 3.3940 3.3656 12.8389 1.6578 1.6577 2.8727 2.7485 2.1498 1.4338 2.2352 1.1383 1.1385 3.1414 1.1286 1.2691 1.1023 1.1015 6.9885 2.1915 1.2600 1.2598 2.2055 1.6261 1.6284 1.3643 1.3659 2.0215 1.7568 5.7332 9.8890 5.1485 4.7282 11.7031 4.0028 3.7965 9.4634 2.4162 2.4102 1.1308 1.1314 1.4313 1.3929 1.6801 1.6473 2.5535 2.5566 11.4575 5.3782 5.2098 6.1965 5.8491 7.8320 4.5070 5.4468 6.4538 7.1792 1.0646 1.0646 1.0654 1.0654 1.0967 1.0967 1.1042 1.1042 1.0886 1.0886 1.0951 1.0951 1.0914 1.0914 1.0950 1.0950 1.0768 1.0768 1.0788 1.0788
irintensity: 0.2758 0.8949 9.4202 0.3000 0.2648 0.1556 0.1569 0.9870 0.7182 0.3475 7.2416 6.7730 3.1017 0.0607 4.0717 1.2170 0.5904 1.1790 1.5861 2.7111 7.1827 0.0312 15.3666 0.0146 0.0695 10.2223 0.0458 6.2865 0.4995 1.5974 24.1485 6.5754 22.8375 20.0868 27.0283 12.3728 0.0734 11.7243 152.1924 8.0477 23.8712 3.2207 3.2677 13.8109 30.0133 2.7716 1.6682 27.4443 12.0376 2.8597 0.3035 30.9684 1.9598 11.1510 3.4425 16.3240 17.9887 2.7284 69.5440 13.3153 1.0396 80.9997 5.0517 0.6778 7.5075 2.5654 15.9783 0.5275 5.6536 28.9988 55.4019 0.5527 4.3583 0.9913 3.1517 9.9216 15.0781 32.7018 46.3916 20.9219 144.4027 2.3098 3.9817 7.7927 37.2179 2.4475 6.3484 0.4042 19.1775 0.6153 0.0879 0.1296 13.7186 1.0648 2.7241 0.5687 0.3615 68.2578 7.7400 84.4794 4.1458 2.0471 5.7639 5.7509 0.2166 21.8415 1.1654 0.5748 0.5630 203.2281 1.5054 28.0235 14.5529 178.2031 31.6118 93.6067 7.9064 23.4751 1.7073 70.1898 0.3467 17.8655 224.2117 18.8278 130.3898 47.8173 1.5123 113.9002 627.1204 40.7517 0.4216 0.3827 3.5812 11.2520 279.2558 26.8316 505.0207 9.3208 24.8683 146.9521 4.1703 173.7355 41.7253 71.2977 175.9815 31.3404 23.3039 14.4311 184.7401 7.3503 93.3982 52.6975 51.9025 45.8093 47.8260 50.0466 36.3508 1.7062 15.5914 15.1601 0.1374 0.1518 2.9576 2.9191 27.4272 12.0913 10.7470 10.7825
temp: 298.150 k
press: 1.00000 atm
elementType: 9 9 9 9 8 8 7 7 7 7 7 7 6 6 6 6 6 6 6 6 6 6 6 6 6 6 6 6 6 6 6 6 6 6 6 6 6 6 1 1 1 1 1 1 1 1 1 1 1 1 1 1 1 1 1 1 1 1
symmnumber: 1
zpe: 1108311.0 jmol-1
zpe.correction: 0.422133 hartree
zpe.thermalcorrener: 0.455826 hartree
zpe.thermalcorrenthalpy: 0.456771 hartree
zpe.thermalcorrgfe: 0.351420 hartree
zpe.sumelectzpe: -1878.406310 hartree
zpe.sumelectthermal: -1878.372617 hartree
zpe.sumelectthermalent: -1878.371673 hartree
zpe.sumelectthermalfe: -1878.477023 hartree
dipole: 0.0471 -0.0650 5.2216
dipole: 5.2222
quadrupole: -145.6107 -227.0855 -220.7886
quadrupole: 69.7877 0.7888 0.0005
quadrupole: 52.2176 -29.2573 -22.9603 69.7877 0.7888 0.0005
hfenergy: -1878.8284434 hartree
pointgroup: C01 [X(C26H20F4N6O2)]
dipole: -0.0198255 0.0994527 2.0520794 debye
polarizability: 818.3480028|-5.7796145|286.5587254|0.466473|-3.9390834|192.7620824 unknown
InChI: InChI=1S/C26H20F4N6O2/c27-19-17(25(37)35-15-5-1-13(2-6-15)23-31-9-10-32-23)20(28)22(30)18(21(19)29)26(38)36-16-7-3-14(4-8-16)24-33-11-12-34-24/h1-8,31,33,35-36H,9-12H2
charge 0 multiplicity 1
58 atoms
F  -0.822911 2.607458 -0.636823
F  1.822223 2.053317 -0.618985
F  -1.821462 -2.150083 -0.454205
F  0.823711 -2.704528 -0.412568
O  -3.261219 1.517049 -1.536033
O  3.2695 -1.697265 -1.375757
N  -10.196501 -1.028037 1.151912
N  10.188396 1.129866 1.062992
N  -10.199188 1.076331 0.203252
N  10.208024 -1.052191 0.310202
N  -3.755533 -0.161442 0.037457
N  3.754636 0.12029 0.037684
C  -11.648646 -0.752393 1.013652
C  11.642669 0.85505 0.947298
C  -9.473481 0.034804 0.577671
C  9.473907 0.0131 0.589051
C  -11.624228 0.749854 0.541261
C  11.630627 -0.6843 0.614825
C  -8.001245 -0.019905 0.44411
C  8.001146 0.043563 0.45379
C  -5.173968 -0.072679 0.131913
C  5.17329 0.047614 0.140597
C  -7.342442 0.919085 -0.391713
C  7.348647 -0.972616 -0.291754
C  -7.219067 -0.984724 1.132233
C  7.212148 1.061118 1.052407
C  -5.946596 0.903177 -0.557369
C  5.952521 -0.982135 -0.456492
C  -5.82167 -1.011781 0.978627
C  5.814695 1.064161 0.898122
C  -1.424633 0.246564 -0.60188
C  1.426891 -0.348643 -0.570091
C  -2.899932 0.594599 -0.752406
C  2.903152 -0.707372 -0.681878
C  -0.44904 1.271853 -0.626245
C  0.924957 0.971715 -0.608361
C  -0.923295 -1.072226 -0.528311
C  0.450875 -1.372572 -0.514667
H  -12.113189 -1.41683 0.257014
H  -12.181359 -0.885248 1.971474
H  12.175519 1.079819 1.887718
H  12.100296 1.451126 0.131802
H  -11.959698 1.429079 1.347739
H  -12.269715 0.930087 -0.33599
H  12.276977 -0.939106 -0.243076
H  11.97202 -1.283874 1.479859
H  -9.837794 -1.981591 1.183829
H  9.821732 2.079373 1.008517
H  -7.955133 1.664565 -0.907774
H  7.966267 -1.757559 -0.738898
H  -7.691374 -1.697297 1.8173
H  7.679439 1.836429 1.669338
H  -5.450639 1.624043 -1.208615
H  5.461376 -1.763749 -1.037562
H  -5.229572 -1.76021 1.52063
H  5.2174 1.854429 1.370597
H  -3.330338 -0.918316 0.579872
H  3.326126 0.92305 0.506508
