program: Gaussian 09
title: 000262351
version: EM64L-G09RevD.01
frameworkgroup: C1[X(C10H11NO5)]
method: RPBEPBE
basis: SDD
operation: Freq
keyword: #p
keyword: freq=noraman
keyword: PBEPBE/SDD
title: #p freq=noraman PBEPBE/SDD
converged: YES YES NO NO
title: Mulliken charges:
elementType: O O O O O N C C C C C C C C C C H H H H H H H H H H H
charge: -0.261083 -0.245130 -0.246804 -0.204435 -0.201656 0.018597 0.324197 0.266692 -0.137741 -0.135346 -0.523863 -0.352367 0.414090 -0.371755 -0.503399 -0.503028 0.224205 0.223632 0.305810 0.263458 0.289673 0.239396 0.234250 0.204714 0.235755 0.238539 0.203602
chargesum: 0.00000
title: Mulliken charges with hydrogens summed into heavy atoms:
elementType: O O O O O N C C C C C C C C C C
charge: -0.261083 -0.245130 -0.246804 -0.204435 -0.201656 0.018597 0.324197 0.266692 0.086464 0.088286 -0.218053 -0.088909 0.414090 -0.082082 0.174960 0.174868
polarizability: 1.85233073e+02 -2.42817036e+00 1.47787905e+02 5.09918786e+00 2.45827756e+00 7.56683487e+01
1716.lowfreq: -6.3159 -0.0008 -0.0005 -0.0004 5.8256 7.9686 49.2306 56.1525 59.3368
frequency: 49.2289 56.1262 59.3335 90.4368 95.0438 115.1481 140.2915 166.2848 180.7585 188.2007 240.7513 276.3434 293.2738 318.7943 380.9372 405.3677 463.9182 489.8473 493.9780 535.1485 545.8111 578.6792 655.0654 701.9979 712.2480 732.0913 784.2529 838.5238 847.2324 851.3193 878.2052 898.7957 918.0315 921.8990 952.5140 991.5866 1035.0100 1047.3095 1068.8540 1109.7034 1112.3684 1121.5363 1145.8780 1147.5106 1173.4341 1202.9930 1219.2213 1235.6121 1275.0537 1295.8732 1330.0470 1338.9283 1368.6048 1422.3565 1427.3345 1430.0202 1438.3642 1454.1989 1456.2327 1471.8663 1475.4103 1478.9329 1607.0282 1628.6703 2954.0405 2955.0981 2966.3922 2973.9210 3055.6189 3056.1726 3124.8968 3125.8585 3162.0628 3184.7068 3188.6297
redmass: 7.6934 3.7925 6.8070 3.2823 4.6333 2.0408 1.8356 1.9640 1.6929 3.4251 4.5814 4.2573 4.2524 6.7300 4.5620 5.2411 5.4780 5.6593 6.5463 4.7947 5.0427 7.6384 6.8402 6.2486 7.5994 5.3314 7.9198 2.9662 3.0917 3.9143 2.5657 5.1473 3.9861 5.4840 1.7661 1.3688 7.0157 6.5261 2.1421 1.2695 1.2698 1.6134 1.3909 1.3979 1.9366 2.4706 3.4262 1.5640 1.3917 1.3518 1.2217 1.7280 10.8561 6.2889 1.1526 1.1799 4.4852 1.0512 1.0530 3.0016 1.0587 1.0877 8.7398 7.9211 1.0369 1.0366 1.0836 1.0858 1.0978 1.0977 1.1014 1.1013 1.0907 1.0932 1.0957
irintensity: 0.2587 0.8809 0.3575 7.0914 0.7284 0.1814 3.7861 6.1317 4.9549 8.9162 2.0839 1.7428 2.9166 0.5422 3.6823 5.7609 2.5234 9.0640 2.1316 1.6595 2.9642 1.2354 18.4888 21.7253 7.3385 14.1521 12.3955 153.6825 127.2780 83.8165 1.9697 62.8242 7.4840 46.8763 9.9829 2.6054 57.5256 247.8616 41.5025 1.7352 2.8407 0.4684 24.1393 8.7666 3.4896 100.1868 209.4520 19.9766 14.1085 5.4920 19.6530 47.9365 117.2975 3.4516 5.0336 8.0776 23.7899 18.9101 3.0243 3.8099 0.4266 21.4630 4.6399 9.4096 65.8325 78.8232 41.2230 58.7828 33.2124 49.6970 18.1611 20.9061 3.3808 2.7453 3.0014
temp: 298.150 k
press: 1.00000 atm
elementType: 8 8 8 8 8 7 6 6 6 6 6 6 6 6 6 6 1 1 1 1 1 1 1 1 1 1 1
symmnumber: 1
zpe: 527034.1 jmol-1
zpe.correction: 0.200737 hartree
zpe.thermalcorrener: 0.215788 hartree
zpe.thermalcorrenthalpy: 0.216732 hartree
zpe.thermalcorrgfe: 0.157553 hartree
zpe.sumelectzpe: -817.222457 hartree
zpe.sumelectthermal: -817.207405 hartree
zpe.sumelectthermalent: -817.206461 hartree
zpe.sumelectthermalfe: -817.265640 hartree
dipole: 5.7968 -1.1444 1.9202
dipole: 6.2129
quadrupole: -105.3736 -80.4918 -94.3044
quadrupole: 4.0890 -2.4379 -0.1847
quadrupole: -11.9836 12.8981 -0.9145 4.0890 -2.4379 -0.1847
hfenergy: -817.4231932 hartree
pointgroup: C01 [X(C10H11N1O5)]
dipole: -2.2656237 0.5036827 0.7668683 debye
polarizability: 185.0376022|-3.2210982|147.7971387|-6.0196244|-3.4704197|75.854586 unknown
InChI: InChI=1S/C10H11NO5/c1-14-9-7-4-3-6(11(12)13)5-8(7)10(15-2)16-9/h3-5,9-10H,1-2H3
charge 0 multiplicity 1
27 atoms
O  -2.452536 -0.242641 0.939122
O  -1.660256 -2.03384 -0.543208
O  -2.539494 1.594936 -0.69058
O  4.436362 0.612842 -0.427874
O  3.823266 -1.562294 -0.126151
N  3.554077 -0.301981 -0.201234
C  -0.151777 -0.434651 0.412089
C  -0.483323 0.935787 0.350617
C  -1.401048 -1.257348 0.642097
C  -1.974467 1.110949 0.54447
C  1.165418 -0.873394 0.22229
C  0.495803 1.912807 0.093135
C  2.142246 0.120934 -0.012394
C  1.833223 1.499779 -0.082687
C  -2.836395 -2.91128 -0.411416
C  -3.99047 1.835627 -0.604324
H  -1.384375 -1.91406 1.537204
H  -2.270875 1.770929 1.38723
H  1.44832 -1.928542 0.239367
H  0.226905 2.970429 0.019522
H  2.637364 2.213822 -0.277256
H  -2.876377 -3.495355 -1.342629
H  -3.75762 -2.311921 -0.297023
H  -2.728458 -3.594118 0.456769
H  -4.532627 0.888029 -0.434391
H  -4.277269 2.268068 -1.574281
H  -4.227619 2.549686 0.211637
