program: Gaussian 09
title: 000262385
version: EM64L-G09RevD.01
frameworkgroup: C1[X(C19H15NO5S)]
method: RPBEPBE
basis: SDD
operation: Freq
keyword: #p
keyword: freq=noraman
keyword: PBEPBE/SDD
title: #p freq=noraman PBEPBE/SDD
converged: YES YES NO NO
title: Mulliken charges:
elementType: S O O O O O N C C C C C C C C C C C C C C C C C C C H H H H H H H H H H H H H H H
charge: 0.956560 -0.343252 -0.494388 -0.487145 -0.207178 -0.193744 0.015774 0.417444 0.169494 -0.073227 0.292008 0.329239 -0.513531 -0.381522 -0.305102 -0.189971 -0.232536 0.454529 -0.374474 -0.368935 -0.375547 -0.376254 -0.797426 -0.235688 -0.232832 -0.233557 0.286678 0.248386 0.268900 0.301459 0.287617 0.249006 0.246942 0.243689 0.238023 0.230880 0.235253 0.244672 0.232707 0.231683 0.235368
chargesum: 0.00000
title: Mulliken charges with hydrogens summed into heavy atoms:
elementType: S O O O O O N C C C C C C C C C C C C C C C C C C C
charge: 0.956560 -0.343252 -0.494388 -0.487145 -0.207178 -0.193744 0.015774 0.417444 0.169494 -0.073227 0.292008 0.329239 -0.226853 -0.133136 -0.036202 0.111488 0.055081 0.454529 -0.125468 -0.121994 -0.131858 -0.138231 -0.086621 -0.002981 -0.001149 0.001811
polarizability: 6.25904360e+02 -1.10915093e+01 2.58456605e+02 -6.71097038e+00 8.41029039e+00 1.41027825e+02
1716.lowfreq: -0.0010 0.0013 0.0016 1.5400 4.4772 11.4905 15.5012 18.9038 29.2243
frequency: 15.4428 18.2231 29.1783 41.8337 43.2831 49.2582 57.1094 67.3586 90.6327 98.8295 119.7623 128.7908 137.2439 148.8058 181.4382 220.5590 223.9023 264.0945 276.5833 286.9476 301.1671 310.7379 358.1246 377.5829 382.1313 398.3621 403.6109 407.1353 420.4608 435.3677 443.4624 497.0503 505.9638 557.6433 571.4765 585.5282 601.0355 616.3844 619.7164 657.7280 688.8373 698.8435 700.3933 719.7338 747.8068 767.7327 777.3454 781.6758 820.6798 823.3262 837.4599 848.7420 855.9896 873.6737 916.7592 928.8876 948.4754 957.6807 976.0792 978.3842 980.8480 986.4537 989.4702 992.5269 997.9825 1016.3814 1044.6671 1047.4502 1048.6734 1065.2265 1089.2650 1124.5353 1141.4370 1176.5997 1190.1252 1196.0741 1206.9984 1220.6425 1229.2214 1248.1418 1297.1799 1302.3162 1313.5032 1344.5283 1363.1619 1377.4540 1382.8217 1394.9621 1398.9720 1427.4884 1438.2556 1456.4956 1469.6163 1470.3471 1474.8840 1498.8834 1528.5509 1584.1528 1589.2993 1590.4169 1599.5592 1612.0027 2981.2369 3064.2894 3094.9972 3128.3387 3131.9898 3140.7200 3143.5419 3144.0020 3149.0937 3154.0129 3169.1541 3169.2688 3171.2913 3174.6486 3188.3744
redmass: 6.4602 5.6823 7.8831 1.4781 2.1701 4.6975 4.5390 7.6207 8.7459 6.3404 4.8453 5.4849 6.4312 14.3515 7.1095 7.2170 7.8517 7.2709 6.3931 5.7254 5.3751 9.6358 7.5756 3.8296 5.4405 7.2967 2.8638 2.9201 8.3550 4.3939 7.8499 3.4573 3.4204 4.3847 6.4849 6.1070 4.7251 6.2001 6.9452 7.9869 5.9270 1.6967 3.2859 7.4916 4.2338 2.6094 4.1382 4.0301 1.4488 7.9049 1.2496 1.2722 1.6400 5.7001 1.4299 1.5306 14.4153 1.3093 1.4640 1.3947 1.4419 5.1431 4.2499 1.4626 1.3276 3.8163 1.9122 2.4276 1.6019 3.7436 1.6208 1.2922 1.5155 1.0549 1.1334 1.3328 3.7942 3.1326 4.9973 1.4862 2.4210 1.2585 1.6407 2.3134 10.5161 7.2748 6.1270 2.8937 1.2313 5.2431 2.4836 2.3957 1.1476 2.0877 1.0724 2.7931 6.4803 5.9560 6.7159 6.0269 6.1138 6.0780 1.0392 1.0944 1.1002 1.0849 1.0876 1.0895 1.0919 1.0908 1.0888 1.0961 1.1011 1.0964 1.0933 1.0947 1.0953
irintensity: 2.3810 2.3685 0.4944 0.6728 0.0479 1.1039 0.3069 0.8548 0.6022 3.4382 0.6160 0.7969 0.8264 1.0375 7.0483 7.3931 16.0408 13.6438 9.7641 4.0195 1.0936 0.1690 22.5555 3.2704 9.7612 17.9905 5.1929 1.2187 97.8929 5.3210 25.8700 76.8689 30.2530 0.5507 7.5739 35.5666 11.4615 1.6872 0.8660 10.2427 3.9118 52.2176 0.6403 8.3273 2.1760 34.6779 11.8987 22.0772 77.4183 44.7048 1.7228 2.5624 35.9719 5.6222 12.2743 5.5570 56.8012 1.3401 1.8437 0.2784 0.6591 3.9509 2.2990 2.0674 0.0161 7.5101 3.5824 38.0834 36.1199 1.1172 5.9943 8.0685 13.6848 0.0717 39.1609 43.3825 133.9862 16.3313 46.7118 4.5601 26.5557 1.9144 2.5926 3.8685 114.4326 0.7114 2.1875 12.3855 17.1642 7.7370 6.5825 71.7673 16.4333 27.0759 15.3579 1.4141 3.9665 3.2481 5.5600 19.9629 155.9009 0.1855 23.8420 17.3748 14.1753 6.4826 0.1270 13.4157 13.6605 10.2983 3.8404 30.7610 45.9477 1.8073 0.4020 8.3526 10.5169
temp: 298.150 k
press: 1.00000 atm
elementType: 16 8 8 8 8 8 7 6 6 6 6 6 6 6 6 6 6 6 6 6 6 6 6 6 6 6 1 1 1 1 1 1 1 1 1 1 1 1 1 1 1
symmnumber: 1
zpe: 774647.7 jmol-1
zpe.correction: 0.295048 hartree
zpe.thermalcorrener: 0.319207 hartree
zpe.thermalcorrenthalpy: 0.320152 hartree
zpe.thermalcorrgfe: 0.237332 hartree
zpe.sumelectzpe: -1559.877683 hartree
zpe.sumelectthermal: -1559.853523 hartree
zpe.sumelectthermalent: -1559.852579 hartree
zpe.sumelectthermalfe: -1559.935399 hartree
dipole: 0.0897 0.1307 -1.3951
dipole: 1.4041
quadrupole: -87.3057 -163.1234 -164.4230
quadrupole: 11.0521 -4.6625 5.0365
quadrupole: 50.9783 -24.8394 -26.1390 11.0521 -4.6625 5.0365
hfenergy: -1560.1727308 hartree
pointgroup: C01 [X(C19H15N1O5S1)]
dipole: 0.0281744 0.1496228 0.5310129 debye
polarizability: 625.3859901|18.2610912|249.3692503|7.2713799|-32.9143451|150.6335498 unknown
InChI: InChI=1S/C12H8NO3.C7H7O2S/c14-12-7-6-10(8-11(12)13(15)16)9-4-2-1-3-5-9;1-6-2-4-7(5-3-6)10(8)9/h1-8H;2-5H,1H3
charge 0 multiplicity 1
41 atoms
S  2.257126 1.367952 -0.964384
O  1.085002 1.176976 0.741114
O  2.433127 2.968589 -1.171904
O  1.583794 0.462392 -2.1300
O  -0.494781 -2.675026 1.234731
O  1.304132 -1.579935 0.37331
N  0.064888 -1.625517 0.722909
C  -3.062809 0.42818 0.18671
C  -0.226032 0.89525 0.488004
C  3.874912 0.650263 -0.361778
C  -0.782287 -0.429453 0.523119
C  -4.522944 0.188263 0.039872
C  -2.165858 -0.649425 0.400008
C  -2.516053 1.745665 0.12358
C  -1.141624 1.96998 0.273818
C  4.084012 -0.733689 -0.475479
C  4.816428 1.54757 0.170144
C  6.326533 -0.376521 0.495726
C  5.330427 -1.234012 -0.044689
C  6.050817 1.013465 0.597248
C  -5.154937 -0.901222 0.703429
C  -5.32545 1.042757 -0.767494
C  7.667396 -0.933273 0.934096
C  -6.539939 -1.126716 0.566012
C  -6.710318 0.816012 -0.906511
C  -7.325246 -0.269432 -0.239784
H  -2.525011 -1.681288 0.4406
H  -3.185508 2.601597 -0.009527
H  -0.726423 2.982602 0.255356
H  3.30873 -1.390612 -0.876424
H  4.597657 2.617822 0.232531
H  5.524477 -2.309688 -0.119602
H  6.807809 1.687027 1.014161
H  -4.567715 -1.556071 1.356972
H  -4.859661 1.867266 -1.31877
H  8.14642 -0.291357 1.692914
H  7.566115 -1.948515 1.355194
H  8.361715 -1.003127 0.074334
H  -7.007906 -1.964824 1.093679
H  -7.307645 1.478812 -1.542022
H  -8.401073 -0.445237 -0.347198
