program: Gaussian 09
title: 000262355
version: EM64L-G09RevD.01
frameworkgroup: C1[X(C12H10ClNOS)]
method: RPBEPBE
basis: SDD
operation: Freq
keyword: #p
keyword: freq=noraman
keyword: PBEPBE/SDD
title: #p freq=noraman PBEPBE/SDD
converged: YES YES NO NO
title: Mulliken charges:
elementType: Cl S O N C C C C C C C C C C C C H H H H H H H H H H
charge: -0.060781 0.712999 -0.570301 -0.625058 0.523555 -0.182172 -0.288203 -0.309683 -0.250920 -0.200081 -0.218267 -0.213488 -0.207402 -0.213330 -0.237218 -0.221195 0.312118 0.243788 0.302772 0.266303 0.255504 0.232219 0.239716 0.237072 0.236414 0.235640
chargesum: 0.00000
title: Mulliken charges with hydrogens summed into heavy atoms:
elementType: Cl S O N C C C C C C C C C C C C
charge: -0.060781 0.712999 -0.570301 -0.312940 0.523555 -0.182172 -0.288203 -0.065895 0.051852 0.066222 0.037237 0.018731 0.032314 0.023741 -0.000804 0.014445
polarizability: 2.76375921e+02 2.46391064e+01 1.39180024e+02 3.44402605e+00 9.47007192e+00 1.30122220e+02
1716.lowfreq: -7.0618 -2.4046 0.0019 0.0023 0.0028 3.3019 17.6967 27.0627 43.9479
frequency: 17.6133 27.0413 43.9462 58.0080 104.6247 138.8845 161.7034 186.7036 205.9150 247.3234 286.0239 318.0734 350.1494 386.0787 402.9881 417.9867 437.0605 475.4004 510.2753 544.0309 571.7236 605.4288 655.4556 660.4424 696.0162 709.2341 754.3953 755.2531 802.0132 826.0490 839.1413 851.0956 855.9973 935.2945 935.9672 976.7321 980.2084 985.9122 1005.6367 1009.6829 1010.2230 1034.4196 1045.9871 1075.2261 1122.0637 1169.2007 1171.6340 1177.2120 1224.4089 1258.3348 1301.0423 1310.1400 1384.3811 1388.6327 1432.1584 1435.8224 1453.2469 1455.9638 1569.2611 1581.1303 1597.3715 1598.6388 3128.7655 3136.3676 3137.6630 3148.0674 3150.8038 3160.2177 3162.6291 3171.3839 3177.5311 3382.6387
redmass: 7.9726 5.1543 5.8545 6.1108 5.7247 6.6584 6.2660 6.8547 7.8027 7.3041 6.0532 7.1037 7.4749 9.5662 2.9410 8.1562 3.3062 3.6913 3.0854 4.0924 6.2081 6.4708 6.8327 6.8614 2.3817 3.4341 1.3103 1.4281 1.6596 5.7753 5.8077 1.3929 1.3044 1.3630 1.3665 1.3293 5.9942 1.3734 1.3307 4.4888 6.1740 1.9998 2.0816 1.5555 1.6298 1.0619 1.0619 1.1223 1.3988 2.7961 1.3101 1.4123 9.0768 4.2161 2.1970 2.3023 2.0376 2.6287 5.8906 5.8323 6.8846 6.7423 1.0872 1.0878 1.0858 1.0916 1.0899 1.0960 1.0951 1.1012 1.1005 1.0747
irintensity: 1.0782 0.3628 1.2548 1.8276 0.2968 2.1777 1.2337 2.3871 15.4379 4.0017 4.6784 18.3706 13.8605 10.0589 1.0048 12.8873 15.8168 10.1441 41.7493 8.6639 11.1854 0.0834 1.4510 20.2882 37.3517 2.4032 92.6841 82.5267 92.3595 17.5190 61.0479 0.6081 5.7562 2.4899 1.7366 0.0259 2.6196 1.8792 1.4512 10.1872 38.1968 9.4268 17.9447 8.3636 3.6393 0.0123 1.2204 10.9511 6.3115 71.1335 3.1771 7.9856 4.3321 9.3498 13.5153 13.5858 26.0732 87.3533 3.7968 4.8584 20.2514 1.2841 5.2093 2.7403 4.6610 5.8007 7.0603 19.7912 11.9287 28.7682 15.7994 25.6856
temp: 298.150 k
press: 1.00000 atm
elementType: 17 16 8 7 6 6 6 6 6 6 6 6 6 6 6 6 1 1 1 1 1 1 1 1 1 1
symmnumber: 1
zpe: 492168.1 jmol-1
zpe.correction: 0.187457 hartree
zpe.thermalcorrener: 0.202369 hartree
zpe.thermalcorrenthalpy: 0.203313 hartree
zpe.thermalcorrgfe: 0.142507 hartree
zpe.sumelectzpe: -1450.150572 hartree
zpe.sumelectthermal: -1450.135660 hartree
zpe.sumelectthermalent: -1450.134716 hartree
zpe.sumelectthermalfe: -1450.195521 hartree
dipole: 1.0912 -0.8313 -3.2166
dipole: 3.4969
quadrupole: -81.4671 -104.4512 -114.7480
quadrupole: 7.2952 -3.0282 4.0098
quadrupole: 18.7550 -4.2291 -14.5259 7.2952 -3.0282 4.0098
hfenergy: -1450.3380288 hartree
pointgroup: C01 [X(C12H10Cl1N1O1S1)]
dipole: 0.4523843 0.1235955 -1.2934038 debye
dipolederiv: -0.1947622 -0.1988456 -0.1023782 -0.085603 -0.5261413 -0.239138 -0.0526159 -0.2633749 -0.1869902 1.0079135 -0.0656017 0.0159949 -0.333861 0.8058686 -0.3329648 -0.1170372 -0.3905066 0.6805932 -0.5792781 -0.0031031 0.0039056 0.1875742 -0.4833648 0.004101 -0.3176798 0.4337754 -0.6432124 -1.134664 -0.0302978 -0.0795838 0.1792913 -0.3758446 0.2252132 0.618684 -0.0467333 -0.279892 1.1213665 -0.1568809 0.0820209 0.2003379 -0.2126765 -0.0274785 -0.0194441 -0.0747602 0.0203801 0.1572846 0.0543772 0.0014421 0.0311656 -0.1388158 0.0283758 0.0332161 -0.0091505 -0.0619444 -0.1262152 0.339627 0.1172374 0.2778319 0.6950787 0.4026927 -0.0058524 0.437967 0.1187051 -0.151194 0.0667569 0.0034294 -0.2337747 -0.0081111 0.0562375 -0.0342851 0.0573333 -0.1063405 -0.2320599 0.0022431 -0.0859242 -0.0804609 -0.1131634 -0.0159095 0.2066544 0.0194185 -0.0809083 -0.1832558 -0.013559 0.1609964 -0.0581376 -0.1045644 0.0303989 -0.1186513 -0.0323874 0.0000005 0.0134331 -0.0703818 -0.023015 -0.1016337 -0.1164169 -0.0148839 -0.0354782 -0.0230309 -0.0793697 -0.007288 0.0110119 -0.0155133 0.1213729 0.0470069 0.1230845 0.0943618 0.0997967 -0.0597338 0.0181551 0.041783 0.167874 0.0667386 -0.1201399 0.0309316 0.084025 -0.0035043 0.0597132 -0.1145429 0.0496397 -0.0797527 0.0144386 -0.1104936 -0.084146 -0.0153855 -0.0439159 0.0837167 -0.0555959 0.0007731 -0.0265938 -0.0352432 -0.0747842 0.0341314 -0.0252592 0.0519825 -0.1675309 0.0754494 0.1085115 -0.0223009 0.0789815 -0.0902518 -0.028451 0.0061875 -0.0305454 -0.0195078 0.1695582 0.0665877 -0.0841631 -0.0438223 0.1298571 -0.0130416 -0.2149952 -0.0007726 0.1390393 0.0293949 0.0709021 0.0536686 0.0795294 0.0240277 -0.0644551 0.0364693 -0.06266 0.1023175 0.2278803 -0.0365349 0.0494127 0.0015042 0.141967 0.0295812 -0.0004774 0.0134587 0.064736 0.0718679 -0.0363547 -0.0945273 -0.0129595 0.1341607 -0.005986 -0.0928411 -0.0013775 0.0478315 0.0418793 0.0542235 0.0211314 0.0676145 0.0306905 -0.0710455 0.0503449 -0.065317 0.1285721 0.0382784 -0.0588267 -0.0413856 -0.0845384 -0.0169553 -0.1071345 -0.0575677 -0.0978411 0.0974246 -0.0312468 -0.046293 -0.0824943 -0.0581679 0.1419609 -0.0055964 -0.1032125 -0.0081273 -0.0173561 0.0384096 -0.0403545 0.0474094 -0.060741 0.1326377 0.0607809 0.0677126 0.0551311 -0.0762334 -0.1152401 -0.0166833 -0.0167261 -0.0107014 0.0934814 -0.0403333 -0.0197307 -0.0368974 0.1446572 -0.0855281 -0.0927198 0.0298356 -0.1067358 0.1149866 0.0250354 0.0328578 0.0220392 0.0913325 unknown
polarizability: 278.4040868|11.3904332|129.2843846|14.266685|9.2944993|137.9896942 unknown
InChI: InChI=1S/C12H10ClNOS/c13-11-8-4-5-9-12(11)14-16(15)10-6-2-1-3-7-10/h1-9,14H
charge 0 multiplicity 1
26 atoms
Cl -1.941281 2.53743 1.197253
S  0.541032 -1.297945 0.567555
O  0.52228 -1.337564 2.220157
N  -0.436854 0.206744 -0.183108
C  -1.847704 0.098372 -0.195494
C  2.210266 -0.47304 0.177422
C  -2.700177 1.09137 0.36564
C  -2.47723 -1.004952 -0.842394
C  3.084818 -0.29594 1.262789
C  2.543953 -0.120575 -1.144193
C  -4.101118 1.018628 0.286311
C  -3.879303 -1.107467 -0.903478
C  4.355943 0.270515 1.011016
C  3.820038 0.443072 -1.380136
C  -4.698342 -0.096174 -0.344971
C  4.722291 0.635323 -0.306145
H  -0.093768 1.070213 0.276233
H  -1.842511 -1.770964 -1.30057
H  2.755476 -0.586395 2.268045
H  1.826855 -0.256397 -1.959826
H  -4.713398 1.813495 0.722231
H  -4.336109 -1.970166 -1.399674
H  5.056048 0.423702 1.839153
H  4.1045 0.7334 -2.397158
H  -5.789014 -0.168049 -0.399624
H  5.70951 1.070765 -0.49623
