program: Gaussian 09
title: 000262384
version: EM64L-G09RevD.01
frameworkgroup: C1[X(C19H14Br2O3S)]
method: RPBEPBE
basis: SDD
operation: Freq
keyword: #p
keyword: freq=noraman
keyword: PBEPBE/SDD
title: #p freq=noraman PBEPBE/SDD
converged: YES YES NO NO
title: Mulliken charges:
elementType: Br Br S O O O C C C C C C C C C C C C C C C C C C C H H H H H H H H H H H H H H
charge: 0.078734 0.045566 0.949279 -0.304860 -0.482541 -0.499523 -0.097357 0.396252 0.463724 0.321393 -0.336693 -0.335119 -0.219132 -0.213958 0.448050 -0.368864 -0.355225 -0.360986 -0.361366 -0.370051 -0.369490 -0.798864 -0.237181 -0.236278 -0.231599 0.260254 0.259254 0.291980 0.285379 0.244323 0.245694 0.238767 0.241695 0.231832 0.231166 0.244741 0.232125 0.233051 0.235828
chargesum: 0.00000
title: Mulliken charges with hydrogens summed into heavy atoms:
elementType: Br Br S O O O C C C C C C C C C C C C C C C C C C C
charge: 0.078734 0.045566 0.949279 -0.304860 -0.482541 -0.499523 -0.097357 0.396252 0.463724 0.321393 -0.076439 -0.075865 0.072848 0.071420 0.448050 -0.368864 -0.355225 -0.116664 -0.115672 -0.131284 -0.127795 -0.091125 -0.005056 -0.003227 0.004229
polarizability: 6.43438451e+02 -3.17573306e+01 3.09970670e+02 1.10860650e+01 6.13855484e+00 1.55129140e+02
1716.lowfreq: -29.6062 -8.5367 -3.3009 0.0001 0.0011 0.0013 3.4327 5.1590 15.3653
frequency: -29.5789 -4.6603 15.0184 26.9723 41.8703 45.0501 47.7283 64.9249 69.9401 81.4395 107.9604 113.6438 125.7454 145.4142 181.8457 188.2557 217.6693 222.7629 225.6045 258.7592 272.0167 275.7367 294.3707 311.2505 369.0863 375.4635 400.2443 403.6079 406.5220 414.2316 441.0143 490.7333 502.3841 508.1043 567.4471 579.8815 591.6788 614.0628 618.7928 629.6610 697.4218 703.4052 710.5899 731.3138 765.7891 771.8818 775.5900 804.3278 822.4646 840.6139 845.8033 853.7224 883.9528 886.6944 925.2585 931.6904 961.3679 975.5966 979.9782 987.5778 988.6084 990.2474 998.1814 1015.3020 1039.1537 1045.6875 1048.1686 1051.4498 1089.6023 1119.7730 1176.1121 1184.3994 1185.5876 1197.9132 1218.5474 1251.6266 1278.8098 1297.2678 1308.6380 1327.0909 1370.9231 1380.8672 1391.5183 1398.6807 1401.1949 1406.9839 1432.3432 1468.7737 1469.7639 1473.5168 1485.4867 1490.6290 1575.7983 1581.7514 1589.8373 1591.0747 1609.4193 2980.5497 3063.4743 3093.6129 3129.5237 3133.9159 3135.9972 3138.8587 3145.3838 3154.9642 3166.2258 3167.4896 3168.7331 3169.3966 3171.4277
redmass: 1.0136 7.0396 6.4637 10.7711 8.1453 4.2855 4.2782 13.0161 8.2550 7.5905 7.1640 6.9170 12.3344 9.9628 7.6270 4.5324 7.0519 7.6069 16.2443 8.6564 10.7753 5.7485 4.9196 7.8241 5.0358 5.1215 5.8084 2.9510 2.8698 9.5364 6.9045 4.1043 3.2346 4.8024 5.6069 6.0730 8.6509 6.0785 6.9537 3.5314 1.7642 3.2735 8.6726 6.7766 6.7408 1.8492 4.8434 16.7745 1.3464 1.2487 1.5673 3.3052 1.5356 1.3677 1.4536 16.6771 1.3072 1.4638 1.3948 5.8645 4.9178 1.4051 1.3266 5.0155 3.1565 2.4213 1.5982 2.1094 1.6141 1.2852 1.0763 2.0241 1.1421 1.1338 3.1023 3.0930 3.1431 1.2605 1.7534 1.8753 5.2518 6.2852 2.9659 1.2192 3.2171 5.6189 2.4746 2.2963 1.1123 1.0588 6.1791 2.5312 6.2069 5.8241 6.2830 6.4931 6.0042 1.0392 1.0944 1.1001 1.0848 1.0875 1.0896 1.0897 1.0921 1.0966 1.0951 1.0913 1.0965 1.0990 1.0951
irintensity: 0.5356 1.7475 0.6615 0.3899 0.0963 0.8505 0.1051 1.0866 0.8124 0.0765 2.4198 3.5298 6.8698 14.1722 9.5204 0.0871 28.6824 1.2675 0.2561 11.3493 9.3169 7.9811 4.8708 28.3092 4.1315 6.1663 10.1651 5.9447 0.3177 124.3872 8.3027 35.7656 61.8234 2.8821 3.5404 18.3452 16.9346 0.5917 0.2344 2.3428 39.9168 0.3928 78.7575 8.2119 2.5121 64.2555 1.0353 100.3116 36.9082 0.6008 3.9638 1.2089 24.0134 0.6434 0.4965 49.6253 1.3552 1.9142 0.1648 7.6074 3.5596 1.2870 0.0240 7.0013 15.6673 34.9729 35.7783 0.7695 8.0417 9.4758 1.0640 19.9539 46.8030 18.3938 17.5604 34.9565 62.0211 2.4616 5.7881 2.3784 5.8617 0.6369 9.6491 17.0233 7.2694 48.0832 11.7998 32.3364 17.3260 14.0453 106.3973 17.6705 344.5411 1.5001 12.0408 6.3260 1.6082 26.5251 17.0330 13.8756 5.5076 0.0590 11.5932 14.8724 10.9960 28.8404 0.0926 2.0525 17.1050 18.2125 28.5035
temp: 298.150 k
press: 1.00000 atm
elementType: 35 35 16 8 8 8 6 6 6 6 6 6 6 6 6 6 6 6 6 6 6 6 6 6 6 1 1 1 1 1 1 1 1 1 1 1 1 1 1
symmnumber: 1
zpe: 716875.5 jmol-1
zpe.correction: 0.273043 hartree
zpe.thermalcorrener: 0.296078 hartree
zpe.thermalcorrenthalpy: 0.297023 hartree
zpe.thermalcorrgfe: 0.216871 hartree
zpe.sumelectzpe: -1381.155053 hartree
zpe.sumelectthermal: -1381.132018 hartree
zpe.sumelectthermalent: -1381.131074 hartree
zpe.sumelectthermalfe: -1381.211225 hartree
dipole: 0.2270 -5.1020 -0.3562
dipole: 5.1194
quadrupole: -106.0540 -168.0263 -179.1506
quadrupole: 9.6716 6.1052 -2.6805
quadrupole: 45.0230 -16.9493 -28.0737 9.6716 6.1052 -2.6805
hfenergy: -1381.4280968 hartree
pointgroup: C01 [X(C19H14Br2O3S1)]
dipole: -0.1148331 1.5345282 -1.2995285 debye
polarizability: 643.5504029|-34.4448598|249.9118657|0.4965105|-75.0133122|215.075992 unknown
InChI: InChI=1S/C12H7Br2O.C7H7O2S/c13-10-6-9(7-11(14)12(10)15)8-4-2-1-3-5-8;1-6-2-4-7(5-3-6)10(8)9/h1-7H;2-5H,1H3
charge 0 multiplicity 1
39 atoms
Br -0.783176 -3.528915 1.551859
Br 0.721951 0.89555 -1.92332
S  2.30975 -1.23371 1.364609
O  1.032849 -1.775744 -0.300499
O  2.80784 -2.578896 2.13361
O  1.48886 -0.055224 2.140296
C  3.811142 -0.4870 0.51453
C  -2.948152 -0.318551 -0.177237
C  -0.21221 -1.280204 -0.208186
C  -4.350837 0.171063 -0.167801
C  -2.576855 -1.484334 0.55281
C  -1.941155 0.370062 -0.914871
C  3.819849 0.893424 0.260077
C  4.870604 -1.347456 0.182542
C  6.072915 0.61496 -0.709474
C  -1.254631 -1.941504 0.540568
C  -0.620477 -0.089495 -0.91165
C  4.969693 1.436236 -0.352352
C  6.004957 -0.777073 -0.434517
C  -4.889343 0.867964 -1.287091
C  -5.193054 -0.044731 0.96028
C  7.311412 1.217453 -1.345417
C  -6.221245 1.329725 -1.279463
C  -6.523794 0.420289 0.968679
C  -7.04585 1.109006 -0.15136
H  -3.334538 -2.048593 1.102484
H  -2.190797 1.287851 -1.453613
H  2.967324 1.519978 0.539135
H  4.816177 -2.416102 0.411652
H  5.007428 2.512471 -0.556264
H  6.847093 -1.424105 -0.704801
H  -4.275754 1.017247 -2.182526
H  -4.794651 -0.545195 1.849693
H  7.821455 0.495158 -2.005857
H  7.06761 2.114835 -1.939746
H  8.03971 1.524528 -0.569841
H  -6.619044 1.852969 -2.155739
H  -7.150604 0.254078 1.851443
H  -8.080452 1.468687 -0.14514
