program: Gaussian 09
title: 000262354
version: EM64L-G09RevD.01
frameworkgroup: C1[X(C12H10ClNOS)]
method: RPBEPBE
basis: SDD
operation: Freq
keyword: #p
keyword: freq=noraman
keyword: PBEPBE/SDD
title: #p freq=noraman PBEPBE/SDD
converged: YES YES NO NO
title: Mulliken charges:
elementType: Cl S O N C C C C C C C C C C C C H H H H H H H H H H
charge: -0.054221 0.701473 -0.576705 -0.601280 0.392688 -0.191183 -0.350953 -0.322764 -0.249814 -0.200402 -0.175681 -0.191970 -0.208053 -0.214599 -0.112024 -0.221725 0.297001 0.235327 0.249452 0.302489 0.266900 0.256694 0.256422 0.239656 0.237368 0.235904
chargesum: 0.00000
title: Mulliken charges with hydrogens summed into heavy atoms:
elementType: Cl S O N C C C C C C C C C C C C
charge: -0.054221 0.701473 -0.576705 -0.304279 0.392688 -0.191183 -0.115626 -0.073312 0.052676 0.066497 0.081012 0.064452 0.031603 0.022769 -0.112024 0.014179
polarizability: 3.24023461e+02 -2.52193390e+00 1.36417074e+02 -9.72400807e+00 1.14855314e+01 1.10350482e+02
1716.lowfreq: -15.6469 -4.2133 -3.6430 0.0024 0.0024 0.0028 19.6078 25.1201 38.9353
frequency: 19.5648 25.1017 38.9197 59.9898 83.3293 126.5724 164.8723 201.2020 214.9202 242.4828 304.4339 318.5934 359.2068 376.9503 402.6743 410.9148 415.7971 435.2701 488.8238 525.7775 605.4331 624.3094 629.7659 655.2152 695.4847 703.6710 755.5921 801.5402 811.3680 819.0753 831.1673 841.0191 855.8689 934.8639 939.6853 956.3800 980.4242 985.9091 992.8895 1005.5635 1009.9913 1045.2929 1070.5240 1075.0278 1104.0280 1171.5915 1176.4409 1177.2459 1227.8586 1234.4386 1299.3495 1300.6281 1384.2732 1384.4751 1409.3553 1431.6823 1453.3267 1470.5163 1578.2671 1581.2423 1592.6232 1598.1258 3129.0600 3135.7714 3136.4783 3148.1568 3150.6838 3160.2152 3171.3913 3171.6612 3175.3670 3372.9674
redmass: 6.5991 5.1065 5.4940 5.6133 7.8288 9.8806 5.9667 6.5208 8.1603 7.7607 8.7695 6.2724 6.7398 8.6673 2.8692 3.1885 5.8722 3.2304 3.4442 3.2017 6.4736 6.5197 7.2723 6.8549 2.3824 3.4151 1.4279 1.4772 3.4745 1.8459 2.3107 2.3564 1.2895 1.3581 1.3503 1.3607 6.0617 1.3750 3.9739 1.3255 4.2527 2.0698 2.7362 1.5591 1.3479 1.0636 1.1236 1.1240 1.6240 2.2101 1.3233 1.3124 9.0557 5.1277 2.7731 2.1893 2.0379 2.3955 6.9734 5.8543 6.3129 6.7171 1.0869 1.0899 1.0880 1.0916 1.0888 1.0961 1.1011 1.0957 1.0973 1.0752
irintensity: 0.2470 0.6205 0.5658 1.9379 0.4834 1.7945 1.4112 7.4371 14.8059 0.9413 11.2006 17.1955 10.5500 10.4566 1.2542 0.2252 3.9206 29.9599 52.3602 6.7144 0.2251 0.8421 34.4895 0.5194 36.7760 2.6784 79.9986 29.7362 13.1001 15.3782 108.4500 24.5138 5.2284 3.1993 0.6344 0.1043 3.3493 1.8643 33.7516 1.7428 4.1711 19.3917 58.2453 7.7224 13.4231 1.6616 1.3532 14.1731 31.5000 9.5805 2.8612 3.6477 4.8084 7.2154 8.6987 13.9207 26.7315 129.9511 1.1172 4.8916 2.6451 1.5972 4.7236 7.1258 2.8471 6.0488 5.8152 20.6641 30.0427 5.6745 1.0979 5.5048
temp: 298.150 k
press: 1.00000 atm
elementType: 17 16 8 7 6 6 6 6 6 6 6 6 6 6 6 6 1 1 1 1 1 1 1 1 1 1
symmnumber: 1
zpe: 491477.8 jmol-1
zpe.correction: 0.187194 hartree
zpe.thermalcorrener: 0.202186 hartree
zpe.thermalcorrenthalpy: 0.203130 hartree
zpe.thermalcorrgfe: 0.141933 hartree
zpe.sumelectzpe: -1450.150413 hartree
zpe.sumelectthermal: -1450.135421 hartree
zpe.sumelectthermalent: -1450.134477 hartree
zpe.sumelectthermalfe: -1450.195674 hartree
dipole: -3.5881 -2.8405 1.1884
dipole: 4.7282
quadrupole: -100.8193 -112.3442 -101.5565
quadrupole: 4.6150 -4.0581 6.7285
quadrupole: 4.0874 -7.4375 3.3502 4.6150 -4.0581 6.7285
hfenergy: -1450.3376066 hartree
pointgroup: C01 [X(C12H10Cl1N1O1S1)]
dipole: -1.4645555 -0.7928556 -0.828748 debye
dipolederiv: -1.0770556 0.0029682 0.0577677 -0.0355951 -0.0983601 0.0326641 0.0247597 0.0275053 -0.0974619 0.7995664 -0.0089604 0.0147861 -0.1375168 0.8045586 0.2715638 0.1550194 0.3543578 0.5877767 -0.5579036 -0.0285415 -0.0044193 0.2125734 -0.5168456 -0.0037393 0.3533241 -0.4393673 -0.6114856 -0.7473759 -0.0687524 0.0306882 -0.0353172 -0.3238852 -0.2189101 -0.6455867 0.0028243 -0.2256244 0.9139705 -0.0384212 -0.1112957 0.1311936 -0.0655575 -0.0376414 0.0074403 -0.0022664 0.03113 0.1746331 0.0537519 -0.0165214 0.0736684 -0.1397171 -0.0224001 -0.0340074 0.023247 -0.0614002 -0.1650242 0.0386714 0.0137683 0.1219883 -0.0575581 -0.0971789 0.0640379 -0.1071498 -0.0531989 -0.074234 0.0032161 0.0382892 -0.1173063 -0.0545895 -0.0742493 -0.0092214 -0.0732563 -0.0414367 -0.2499307 0.0096466 0.0862473 -0.1066018 -0.1161103 0.0239178 -0.200104 -0.0139452 -0.0772807 -0.1932012 -0.0268764 -0.1515535 -0.0559978 -0.103522 -0.0157554 0.1293678 0.0399789 -0.0030016 -0.2994852 -0.0244323 0.0476417 -0.1257724 -0.0222539 -0.0385828 0.1029536 -0.0603284 -0.0260729 -0.3447905 0.0402856 0.002271 0.0947472 -0.0337623 -0.0748625 -0.1377706 -0.0518442 -0.0022336 0.0212052 0.0232544 -0.1698901 0.0507409 -0.1244098 -0.008599 -0.0876777 0.0233502 0.0644596 -0.1097949 0.058155 0.0800218 0.0125468 -0.1011666 0.0982551 0.0210983 0.0604551 0.070537 1.3787703 0.027688 -0.0499603 0.0418201 0.0021806 -0.0748421 -0.0009957 -0.0775923 -0.0183381 0.0723655 0.1056704 0.0123673 0.0703401 -0.0914673 0.0333961 -0.0176698 0.0350879 -0.0264749 0.1282526 0.0833863 0.0607681 0.0110997 0.0749007 0.0443504 0.1781637 0.0725327 0.0939389 0.0169944 -0.0718177 0.0625288 -0.0433889 0.0672582 0.0811135 0.0603734 0.0845973 0.0496458 0.0278695 0.052642 -0.0755733 0.0593167 0.0757195 0.0670747 -0.0548684 0.0712465 0.0614952 0.2325484 -0.041103 -0.050658 0.0018081 0.1407275 -0.0371385 -0.0054362 -0.0213597 0.0681507 0.075855 -0.0249886 0.0960383 0.001772 0.137169 -0.0048146 0.0911069 -0.0061819 0.0453249 0.0273044 0.0510333 -0.0461963 0.0381161 0.0846641 0.0805332 -0.0679032 0.07866 0.0842623 0.0457871 -0.0430975 0.0495839 -0.0471967 0.0789943 0.0882639 0.0518247 0.0824032 0.072859 -0.0344725 -0.0362897 0.0877203 -0.0441366 0.1443613 -0.0108908 0.1101469 -0.0084718 -0.0210135 0.031558 -0.0448896 -0.0462367 -0.0678584 0.122979 -0.0767873 -0.0675216 -0.0723998 -0.0613411 -0.0934119 -0.0921987 -0.0181831 -0.1050435 0.1156923 -0.0247405 -0.020854 -0.0220831 0.0967839 unknown
polarizability: 323.3204852|4.7574087|105.8123583|-14.1034609|-0.7770594|141.6581729 unknown
InChI: InChI=1S/C12H10ClNOS/c13-10-6-8-11(9-7-10)14-16(15)12-4-2-1-3-5-12/h1-9,14H
charge 0 multiplicity 1
26 atoms
Cl 6.197401 -0.11509 -0.239403
S  -0.80009 1.193801 0.451069
O  -0.73626 1.354495 2.097003
N  0.140992 -0.415436 -0.193719
C  1.563248 -0.331635 -0.153292
C  -2.49566 0.382685 0.167984
C  2.339216 -1.13712 0.726592
C  2.227682 0.552279 -1.049371
C  -3.35441 0.327341 1.279219
C  -2.862161 -0.083997 -1.109185
C  3.74894 -1.089239 0.691184
C  3.633648 0.630008 -1.068348
C  -4.642051 -0.230013 1.102343
C  -4.15413 -0.637945 -1.270285
C  4.376426 -0.199087 -0.20142
C  -5.040542 -0.707707 -0.168628
H  -0.231769 -1.192128 0.384479
H  1.839505 -1.803458 1.439501
H  1.635385 1.162891 -1.738532
H  -3.001384 0.703042 2.247438
H  -2.1577 -0.040577 -1.945647
H  4.344905 -1.717386 1.359273
H  4.144834 1.310555 -1.755208
H  -5.33073 -0.287525 1.952004
H  -4.463715 -1.014636 -2.251008
H  -6.040682 -1.134917 -0.301145
