program: Gaussian 09
title: 000003821
version: EM64L-G09RevD.01
frameworkgroup: C1[X(C13H16ClNO)]
method: RPBEPBE
basis: SDD
operation: Freq
keyword: #p
keyword: freq=noraman
keyword: PBEPBE/SDD
title: #p freq=noraman PBEPBE/SDD
converged: NO YES NO NO
title: Mulliken charges:
elementType: Cl O N C C C C C C C C C C C C C H H H H H H H H H H H H H H H H
charge: -0.035868 -0.200240 -0.399539 0.144507 -0.519264 -0.392171 -0.415363 0.101596 -0.492509 0.636822 -0.377185 -0.389776 -0.646977 -0.238993 -0.265611 -0.239669 0.217128 0.235742 0.221337 0.205523 0.220152 0.216415 0.240091 0.233875 0.312169 0.246000 0.225307 0.198305 0.234777 0.255917 0.231418 0.236084
chargesum: 0.00000
title: Mulliken charges with hydrogens summed into heavy atoms:
elementType: Cl O N C C C C C C C C C C C C C
charge: -0.035868 -0.200240 -0.087370 0.144507 -0.066394 0.034689 0.021205 0.101596 -0.018543 0.636822 -0.377185 -0.143776 0.011413 0.016924 -0.034193 -0.003585
polarizability: 1.71977925e+02 1.01815634e+01 1.60188004e+02 1.14160998e+01 1.57968083e+00 1.25022118e+02
1716.lowfreq: -13.9055 -4.9121 -0.0012 -0.0011 0.0008 5.4469 47.3405 75.5113 91.7868
frequency: 47.2604 75.4916 91.7659 132.9832 139.8911 151.2876 164.0000 165.9849 197.2133 233.1775 265.6693 308.7679 332.9510 341.2055 372.3385 392.4340 405.3076 433.0981 463.2960 470.7667 490.4708 529.0825 574.7893 594.0700 646.9016 691.7265 701.6107 738.5432 761.1717 795.3155 843.2308 853.2384 871.7728 890.9158 916.4193 944.5659 954.0738 984.9433 996.1931 1019.1808 1037.4020 1040.4273 1070.7368 1085.7130 1109.3730 1114.5565 1124.4005 1130.0994 1160.0556 1174.6291 1186.2986 1214.9118 1225.7778 1243.4531 1251.6163 1275.3005 1295.6052 1318.6804 1334.4596 1341.2026 1361.9593 1418.6153 1438.6076 1444.6824 1452.2195 1457.2088 1467.1717 1469.8346 1472.1204 1484.0455 1499.6047 1568.9546 1597.5650 1618.6008 2881.6465 2982.3969 2985.8130 2990.3657 2995.2076 3009.8201 3035.4104 3042.0652 3056.6254 3066.7581 3091.5742 3133.5111 3148.7836 3160.6933 3174.2404 3490.3102
redmass: 6.6802 3.7454 2.8724 3.9300 7.6179 3.2686 2.8396 2.4226 1.7023 2.7611 3.4313 6.7463 3.3745 3.5071 3.1868 2.7806 3.0312 5.0964 2.8891 2.0586 3.4498 1.9785 3.5535 3.2953 5.6100 2.9427 5.1378 3.6109 1.3015 1.6635 2.3954 2.2659 1.5712 2.0587 2.1229 1.5882 1.7254 1.3310 2.7903 5.2715 2.6786 2.7781 1.7552 1.9381 1.9703 1.2617 1.3798 1.5412 2.2467 1.0743 3.1598 1.8751 2.1943 1.3422 1.4872 1.6891 1.2908 1.4188 1.4260 1.4323 8.2330 2.0953 1.1403 1.4102 1.1144 2.0248 1.0874 1.0895 1.0841 1.1028 1.0488 5.7552 7.0012 8.2592 1.0550 1.0596 1.0604 1.0644 1.0785 1.0619 1.0990 1.1007 1.1022 1.0966 1.1028 1.0853 1.0896 1.0945 1.1000 1.0757
irintensity: 0.0566 0.5500 4.4552 0.9589 0.7001 0.1196 0.9959 2.3515 1.5440 1.7284 1.5540 8.3068 3.1003 11.3622 4.8062 0.0919 16.3057 14.2016 9.2869 15.8168 18.7296 18.2456 22.3427 1.7109 6.4160 9.9429 25.0489 13.0013 63.2124 15.6614 8.5164 0.7674 0.0276 12.4199 8.7498 1.7894 5.0774 0.1618 18.7290 34.4671 5.7378 17.2598 15.5266 1.2805 25.2453 1.9540 3.7137 2.1056 11.4156 1.1052 33.5589 14.3545 13.9162 3.1310 14.7168 15.4284 13.1898 3.8567 1.1886 0.8077 4.9859 18.0409 1.4440 31.0266 16.9949 32.3170 10.4279 6.9463 14.2714 10.0802 25.9953 4.9066 1.7715 127.1308 135.6587 17.6004 39.3030 36.4979 43.2317 11.8107 22.9729 40.3709 54.0545 33.4321 22.9974 1.4230 11.2012 16.5250 14.1178 42.1245
temp: 298.150 k
press: 1.00000 atm
elementType: 17 8 7 6 6 6 6 6 6 6 6 6 6 6 6 6 1 1 1 1 1 1 1 1 1 1 1 1 1 1 1 1
symmnumber: 1
zpe: 686143.4 jmol-1
zpe.correction: 0.261338 hartree
zpe.thermalcorrener: 0.276550 hartree
zpe.thermalcorrenthalpy: 0.277495 hartree
zpe.thermalcorrgfe: 0.219642 hartree
zpe.sumelectzpe: -1093.806138 hartree
zpe.sumelectthermal: -1093.790926 hartree
zpe.sumelectthermalent: -1093.789982 hartree
zpe.sumelectthermalfe: -1093.847835 hartree
dipole: -1.0408 -4.1346 -1.1901
dipole: 4.4265
quadrupole: -96.9406 -103.5820 -98.9086
quadrupole: -3.9806 0.1403 -2.3171
quadrupole: 2.8698 -3.7716 0.9018 -3.9806 0.1403 -2.3171
hfenergy: -1094.0674767 hartree
pointgroup: C01 [X(C13H16Cl1N1O1)]
dipole: -0.4243765 1.6354775 -0.4219639 debye
polarizability: 170.5163254|-16.1529761|152.2968818|-7.7468141|-13.6288052|134.3748397 unknown
InChI: InChI=1S/C13H16ClNO/c1-15-13(9-5-4-8-12(13)16)10-6-2-3-7-11(10)14/h2-3,6-7,15H,4-5,8-9H2,1H3
charge 0 multiplicity 1
32 atoms
Cl -0.831921 -2.045033 1.558045
O  2.324477 -1.844523 0.40033
N  0.551365 -1.382558 -1.548859
C  0.739915 -0.274991 -0.616816
C  1.623328 0.903713 -1.209953
C  1.978232 2.003015 -0.179822
C  2.726227 1.415884 1.039551
C  1.667536 -0.777217 0.534265
C  1.934326 0.215668 1.651086
C  -0.651295 0.212942 -0.139782
C  -1.45949 -0.519596 0.769027
C  -1.260185 1.365663 -0.708188
C  0.032882 -1.159984 -2.89388
C  -2.769409 -0.140439 1.116626
C  -2.575556 1.765335 -0.387651
C  -3.336397 1.014213 0.532719
H  1.121808 1.338744 -2.094806
H  2.553526 0.432038 -1.585311
H  1.057045 2.509593 0.165915
H  2.605365 2.775181 -0.666026
H  2.879775 2.189128 1.815152
H  3.7279 1.05831 0.729753
H  0.984303 0.584602 2.079101
H  2.517743 -0.280134 2.444497
H  1.216148 -2.148214 -1.39705
H  -0.694169 1.966069 -1.426584
H  -0.163356 -2.137203 -3.369518
H  0.710415 -0.587971 -3.572273
H  -0.932956 -0.619157 -2.853489
H  -3.338258 -0.744921 1.829208
H  -3.001117 2.658637 -0.857082
H  -4.356909 1.311808 0.795116
