program: Gaussian 09
title: 000262379
version: EM64L-G09RevD.01
frameworkgroup: C1[X(C19H11N3O8)]
method: RPBEPBE
basis: SDD
operation: Freq
keyword: #p
keyword: freq=noraman
keyword: PBEPBE/SDD
title: #p freq=noraman PBEPBE/SDD
converged: YES YES NO NO
title: Mulliken charges:
elementType: O O O O O O O O N N N C C C C C C C C C C C C C C C C C C C H H H H H H H H H H H
charge: -0.286966 -0.185126 -0.184396 -0.157310 -0.172848 -0.188834 -0.198907 -0.199433 0.009842 0.023544 0.026833 0.482850 0.334193 -0.576685 -0.552251 0.154949 0.292223 0.347894 -0.341463 -0.344177 -0.377845 -0.377017 0.388373 0.173311 0.269782 -0.325322 -0.324009 -0.220620 -0.215737 -0.214710 0.299837 0.291925 0.255353 0.252480 0.292509 0.292072 0.269580 0.269867 0.239801 0.237847 0.238591
chargesum: 0.00000
title: Mulliken charges with hydrogens summed into heavy atoms:
elementType: O O O O O O O O N N N C C C C C C C C C C C C C C C C C C C
charge: -0.286966 -0.185126 -0.184396 -0.157310 -0.172848 -0.188834 -0.198907 -0.199433 0.009842 0.023544 0.026833 0.482850 0.334193 -0.276848 -0.260325 0.154949 0.292223 0.347894 -0.086111 -0.091696 -0.085336 -0.084945 0.388373 0.173311 0.269782 -0.055741 -0.054143 0.019181 0.022110 0.023881
polarizability: 5.18499767e+02 -4.04651791e+00 2.45163049e+02 5.37943116e+00 -3.29444800e+01 1.43488183e+02
1716.lowfreq: -2.6228 -2.3746 -0.0009 -0.0006 -0.0001 2.0130 16.9148 23.2487 24.4569
frequency: 16.8719 23.2070 24.4274 35.8058 42.4276 45.3017 54.3538 66.1217 72.3614 80.6783 102.3955 124.9070 134.3638 153.6749 162.2349 180.9128 190.9187 224.5343 257.1727 277.4723 284.8366 320.4627 338.1090 353.9954 384.8360 400.7300 404.8145 409.9569 430.4170 432.7164 449.6034 461.7284 490.9453 514.9478 522.2091 554.9865 612.9039 625.2443 636.2985 647.2118 659.3298 665.4539 671.2716 674.5449 688.8415 694.6680 704.0471 709.6050 724.0119 746.8896 767.6808 782.0004 793.0402 799.5015 849.3931 860.9542 861.3159 869.5489 869.7388 930.4483 940.6619 946.7605 956.2349 989.5773 990.7546 995.1236 995.9932 1004.2462 1012.2282 1027.2819 1064.8567 1089.4792 1092.8954 1099.8296 1119.8107 1177.4445 1178.9816 1189.8083 1194.8869 1201.5288 1216.9979 1219.7468 1225.2327 1252.1604 1298.0879 1305.2388 1320.4250 1336.5577 1370.1355 1375.0869 1379.2126 1393.6772 1394.5900 1418.8588 1428.1117 1439.9367 1462.9238 1479.0065 1502.4896 1555.2625 1586.6906 1594.0081 1610.0516 1611.4280 1617.5852 1680.3549 3136.8987 3149.1952 3149.6232 3152.9191 3160.6740 3172.1922 3173.8335 3176.4067 3184.9769 3187.2766 3187.6781
redmass: 8.3334 6.3600 6.3863 7.6766 7.2428 10.7751 14.3858 11.1078 5.4869 9.0532 8.9110 8.6862 8.7345 11.7156 6.0350 5.7911 8.9643 8.3302 9.6663 7.6232 8.3725 10.2493 10.7918 8.3268 8.3918 2.8021 6.5456 2.9463 6.5888 4.5682 6.2508 7.5198 4.8349 6.2869 8.9649 6.0991 6.4475 6.8958 9.2366 4.2192 5.5040 6.4848 5.4540 7.7609 6.5899 1.6891 8.1817 8.5433 9.5346 4.3853 8.9103 9.2418 2.0196 7.9731 1.2714 2.1523 1.4118 5.9308 3.2349 1.6574 8.4177 1.4424 1.4180 1.3442 6.1617 1.3786 1.3943 3.2341 1.3414 2.1255 2.9190 1.5733 3.7144 3.4186 1.3182 1.1330 1.6679 1.3865 2.5245 4.0719 2.7035 2.6475 5.4812 3.2326 3.4739 1.3137 1.3170 3.2970 8.4743 12.4604 10.0699 9.7932 11.4155 4.4804 4.9915 2.2585 2.9281 2.2787 3.4262 7.7721 6.1780 7.9357 6.1262 6.0755 7.4969 12.6680 1.0861 1.0904 1.0893 1.0903 1.0942 1.0989 1.0914 1.0922 1.0947 1.0960 1.0971
irintensity: 0.1969 0.5289 0.3724 0.0400 0.4668 4.8759 0.6402 4.3951 0.0154 0.8822 0.8012 0.1903 0.2348 3.0149 0.1620 2.6645 1.4612 4.7851 3.1288 1.0374 5.6089 2.6119 0.2595 0.5401 0.8289 0.0130 1.7912 0.1407 3.0120 0.8210 1.2596 3.8912 10.9187 1.8997 0.7211 4.2064 2.7757 0.4901 4.7264 2.9312 23.5453 6.9313 37.2372 21.9018 16.9311 81.5018 4.9852 18.9499 82.1678 7.0633 20.1121 78.1116 31.2176 4.2361 0.5888 15.7115 6.4548 23.7657 52.5826 15.9540 818.7674 13.1800 3.6954 4.0905 0.2158 0.4326 0.1066 4.5972 0.0255 6.8745 35.0309 9.1870 129.7779 29.7542 11.9142 47.5204 280.2899 47.5576 128.1187 135.1899 584.9619 377.8015 5.0348 30.6787 0.1447 0.9633 0.5492 12.7370 52.2549 62.7811 121.0342 14.0738 41.5662 54.5039 6.4683 30.3836 208.0953 8.0145 63.2896 14.5518 9.8020 5.3786 101.5838 7.4951 3.0216 239.4369 0.3770 5.8372 6.8180 5.0721 14.9255 26.0765 4.5837 2.3693 0.6194 5.1024 4.1693
temp: 298.150 k
press: 1.00000 atm
elementType: 8 8 8 8 8 8 8 8 7 7 7 6 6 6 6 6 6 6 6 6 6 6 6 6 6 6 6 6 6 6 1 1 1 1 1 1 1 1 1 1 1
symmnumber: 1
zpe: 718018.4 jmol-1
zpe.correction: 0.273479 hartree
zpe.thermalcorrener: 0.298663 hartree
zpe.thermalcorrenthalpy: 0.299607 hartree
zpe.thermalcorrgfe: 0.213997 hartree
zpe.sumelectzpe: -1494.330767 hartree
zpe.sumelectthermal: -1494.305583 hartree
zpe.sumelectthermalent: -1494.304639 hartree
zpe.sumelectthermalfe: -1494.390248 hartree
dipole: -4.3376 0.8249 -1.1011
dipole: 4.5506
quadrupole: -185.5523 -188.6024 -169.8917
quadrupole: -0.3165 1.3283 -7.0762
quadrupole: -4.2035 -7.2536 11.4571 -0.3165 1.3283 -7.0762
hfenergy: -1494.6042453 hartree
pointgroup: C01 [X(C19H11N3O8)]
dipole: -1.7142013 -0.2480192 0.4531093 debye
polarizability: 518.5950392|4.0185324|231.3987969|0.0428571|-47.8549788|157.1571641 unknown
InChI: InChI=1S/C19H11N3O8/c23-19(13-4-2-1-3-5-13)30-18-16(21(26)27)10-14(11-17(18)22(28)29)12-6-8-15(9-7-12)20(24)25/h1-11H
charge 0 multiplicity 1
41 atoms
O  -2.521822 -0.220812 0.304785
O  -0.424367 -3.576152 0.793558
O  -0.419112 3.478045 -0.143525
O  -2.089584 -2.773937 -0.54739
O  -2.308402 2.498389 0.665551
O  -2.888347 0.821708 -1.766779
O  8.09454 1.073003 -0.663978
O  8.172631 -0.856793 0.551988
N  -1.015792 -2.629594 0.143223
N  -1.103472 2.446502 0.217968
N  7.530818 0.093648 -0.040323
C  1.74331 -0.045438 0.109149
C  3.23098 -0.009696 0.071983
C  0.98197 1.147362 0.087855
C  1.040786 -1.274515 0.169339
C  -1.145554 -0.106171 0.178565
C  -0.36319 -1.292221 0.172877
C  -0.424855 1.121403 0.142341
C  3.914489 1.037934 -0.607033
C  3.998534 -1.022024 0.713579
C  5.319152 1.07986 -0.64833
C  5.403877 -0.996391 0.681715
C  6.046575 0.058103 -0.00137
C  -3.381927 0.31745 -0.745591
C  -4.803434 0.13662 -0.39998
C  -5.767893 0.62475 -1.323402
C  -5.219897 -0.496519 0.800817
C  -7.140089 0.480857 -1.043992
C  -6.595476 -0.636599 1.072973
C  -7.555624 -0.14966 0.153978
H  1.463767 2.128665 0.069849
H  1.566949 -2.233088 0.173059
H  3.345957 1.809982 -1.135534
H  3.497028 -1.819897 1.270805
H  5.856505 1.874079 -1.172665
H  6.005204 -1.763088 1.176784
H  -5.424179 1.11096 -2.242219
H  -4.470198 -0.871837 1.501449
H  -7.884437 0.857705 -1.752877
H  -6.921038 -1.125173 1.99703
H  -8.623881 -0.261321 0.370067
