program: Gaussian 09
title: 000262321
version: EM64L-G09RevD.01
frameworkgroup: C1[X(C19H14N2O7S)]
method: RPBEPBE
basis: SDD
operation: Freq
keyword: #p
keyword: freq=noraman
keyword: PBEPBE/SDD
title: #p freq=noraman PBEPBE/SDD
converged: YES YES NO NO
title: Mulliken charges:
elementType: S O O O O O O O N N C C C C C C C C C C C C C C C C C C C H H H H H H H H H H H H H H
charge: 0.945656 -0.294823 -0.476806 -0.465921 -0.198243 -0.192326 -0.158148 -0.197388 0.008689 0.024687 0.484079 0.021361 0.328108 0.367160 -0.544980 -0.565108 -0.050001 0.312681 -0.246200 -0.187252 0.457640 -0.360610 -0.363034 -0.331374 -0.401914 -0.235738 -0.236361 -0.795660 -0.229623 0.287246 0.295242 0.291764 0.300734 0.242139 0.237114 0.249935 0.252236 0.235761 0.234999 0.232801 0.246493 0.236827 0.238158
chargesum: 0.00000
title: Mulliken charges with hydrogens summed into heavy atoms:
elementType: S O O O O O O O N N C C C C C C C C C C C C C C C C C C C
charge: 0.945656 -0.294823 -0.476806 -0.465921 -0.198243 -0.192326 -0.158148 -0.197388 0.008689 0.024687 0.484079 0.021361 0.328108 0.367160 -0.257735 -0.269866 -0.050001 0.312681 0.045565 0.113482 0.457640 -0.118471 -0.125921 -0.081440 -0.149678 0.000022 -0.001362 -0.079539 0.008536
polarizability: 6.54890964e+02 1.58754565e+01 2.81814005e+02 -1.20808376e+01 1.63994591e+01 1.58507190e+02
1716.lowfreq: -7.6606 -4.3225 -3.1919 -0.0013 -0.0010 -0.0006 16.2691 19.0332 25.8747
frequency: 16.2463 19.0195 25.8434 30.1555 34.8477 44.9859 51.4392 55.8825 60.0544 76.7133 87.7752 96.0163 115.8081 133.9584 140.0301 159.0388 178.3989 186.2845 222.3160 226.8922 269.9032 277.1938 282.3160 294.8750 308.0130 322.3821 354.7254 369.6614 380.5873 396.4297 401.1597 405.0749 418.7725 443.2851 456.8916 478.6086 498.2737 504.3602 581.2880 592.5289 605.9684 615.4989 617.5643 654.7072 671.7135 676.8350 697.1661 698.1066 715.6737 718.1802 764.9767 771.9826 776.1720 779.0935 821.6808 823.7525 838.3628 848.3286 859.5008 874.3008 920.6972 934.4755 943.5681 949.9285 960.0372 977.6719 980.9126 982.9119 989.3741 993.1153 1000.6842 1025.2280 1044.0538 1048.9810 1064.3903 1091.9041 1097.3326 1126.9837 1177.8745 1192.5504 1194.7448 1197.2322 1205.2699 1211.0674 1220.4144 1240.9984 1292.9747 1303.9373 1315.7966 1340.9783 1365.9414 1371.2391 1378.9175 1382.1941 1394.3093 1400.6626 1426.9383 1436.3821 1440.5581 1468.6573 1468.9502 1474.2691 1496.5878 1520.7202 1584.2565 1585.9530 1588.3903 1600.1896 1612.1475 2984.1293 3064.5244 3096.9785 3131.0364 3134.3632 3141.4833 3145.8236 3145.8499 3156.1463 3166.0772 3170.1628 3171.1478 3174.3899 3176.8010
redmass: 6.6341 5.9370 1.0260 5.6428 8.6665 4.5677 6.4948 11.4785 9.3004 6.8857 7.1379 9.4671 5.2172 7.6503 14.4357 11.1035 5.4219 7.5921 7.6743 7.0711 8.2065 7.0645 6.1174 5.4059 8.5037 10.8445 8.1202 4.8963 5.4707 7.5676 2.8435 2.9240 9.2329 8.6635 5.5450 7.4837 3.5333 3.6634 6.1223 6.4728 5.5068 6.4795 6.9529 5.9157 5.9408 9.6254 1.7395 3.2576 8.3547 10.3436 3.4580 5.1204 4.6863 2.9679 1.3807 12.7513 1.2591 1.2722 11.5422 7.0256 1.4526 1.6067 1.5203 10.7534 1.3120 1.4548 3.0349 1.5897 4.9536 1.5803 1.3301 2.7629 2.4386 1.5988 2.2389 1.6248 4.0609 1.2966 1.0589 1.1535 3.7098 1.7988 2.0367 3.4683 3.1942 6.0014 2.7746 1.2585 1.6141 2.0683 10.4197 9.3504 7.1806 4.7324 2.7683 1.3359 4.7725 3.5051 2.7735 2.2316 1.0640 1.1067 2.6809 6.7839 5.8948 6.2501 6.2452 6.1641 6.1325 1.0382 1.0963 1.0994 1.0852 1.0877 1.0896 1.0902 1.0912 1.0965 1.0967 1.0968 1.1015 1.0907 1.0922
irintensity: 2.4482 1.7724 0.7694 0.9269 0.4248 0.0064 1.5912 0.1683 0.2339 0.9666 1.2899 2.5790 0.4670 2.5459 1.2864 0.8886 1.0806 13.7756 21.0518 7.4151 21.8100 3.4209 3.1770 2.5058 1.6522 7.9415 0.5443 12.2762 5.8844 66.1041 10.7238 1.3989 106.5947 10.0473 5.0374 5.3378 76.7168 19.4716 9.0186 57.1600 8.0591 0.2406 0.7538 9.1777 3.8019 27.3385 50.0785 0.1999 2.5335 4.6763 29.6824 14.4152 0.3988 23.7933 58.6517 51.4238 5.1124 2.5143 22.0412 7.0073 15.7033 6.8805 6.1781 42.1445 0.1213 1.9034 1.3407 0.6944 4.8441 8.8521 0.0108 5.9342 54.1432 14.6992 2.9784 5.7197 2.1629 9.9354 0.1457 49.5829 90.4055 38.3031 75.2196 191.1319 16.2197 7.2770 39.1999 1.6149 1.5327 1.1895 40.8900 118.8353 2.7334 2.7197 14.6801 18.8387 7.9152 139.2538 10.8299 24.3818 15.4062 17.0514 0.8547 7.6899 3.4160 21.0059 19.2874 223.3140 0.2452 19.9511 16.3357 15.0654 4.8943 0.1482 11.2992 5.0000 9.8132 26.4395 8.4904 19.8207 35.0926 2.7402 4.7582
temp: 298.150 k
press: 1.00000 atm
elementType: 16 8 8 8 8 8 8 8 7 7 6 6 6 6 6 6 6 6 6 6 6 6 6 6 6 6 6 6 6 1 1 1 1 1 1 1 1 1 1 1 1 1 1
symmnumber: 1
zpe: 775837.3 jmol-1
zpe.correction: 0.295501 hartree
zpe.thermalcorrener: 0.322597 hartree
zpe.thermalcorrenthalpy: 0.323541 hartree
zpe.thermalcorrgfe: 0.233341 hartree
zpe.sumelectzpe: -1764.163076 hartree
zpe.sumelectthermal: -1764.135980 hartree
zpe.sumelectthermalent: -1764.135036 hartree
zpe.sumelectthermalfe: -1764.225236 hartree
dipole: 0.5788 -2.5370 -1.5527
dipole: 3.0303
quadrupole: -87.2198 -190.9582 -185.5600
quadrupole: 1.3923 -4.8978 6.7983
quadrupole: 67.3595 -36.3789 -30.9806 1.3923 -4.8978 6.7983
hfenergy: -1764.4585773 hartree
pointgroup: C01 [X(C19H14N2O7S1)]
dipole: 0.2155682 -0.7507681 -0.9006687 debye
polarizability: 655.3525171|13.0954757|258.4647811|-6.0907699|50.7318313|181.3948603 unknown
InChI: InChI=1S/C12H7N2O5.C7H7O2S/c15-12-10(13(16)17)6-9(7-11(12)14(18)19)8-4-2-1-3-5-8;1-6-2-4-7(5-3-6)10(8)9/h1-7H;2-5H,1H3
charge 0 multiplicity 1
43 atoms
S  2.181054 0.093233 1.351874
O  1.172215 0.877334 -0.314998
O  1.46058 -1.333953 1.6362
O  2.212418 1.234412 2.501477
O  -1.297318 3.771072 1.045243
O  -0.450752 -3.01017 -0.801401
O  0.353539 3.50148 -0.511905
O  1.246728 -1.646045 -1.454705
N  -0.637023 3.067826 0.181049
N  0.076484 -1.842321 -0.952744
C  -3.034665 0.168425 -0.192989
C  -0.155049 0.629424 -0.325735
C  -1.103699 1.675249 -0.038066
C  -0.747243 -0.661978 -0.575927
C  -2.484601 1.459535 0.03067
C  -2.132768 -0.881226 -0.500555
C  3.86495 -0.080588 0.567951
C  -4.498687 -0.070016 -0.106384
C  4.806343 0.925331 0.849633
C  4.112124 -1.18963 -0.25568
C  6.40679 -0.323521 -0.553751
C  -5.317689 0.738335 0.731918
C  -5.116592 -1.11275 -0.852661
C  6.08764 0.783724 0.279847
C  5.407637 -1.301083 -0.805986
C  -6.705758 0.510516 0.821481
C  -6.505027 -1.339266 -0.763834
C  7.78511 -0.442134 -1.173918
C  -7.306821 -0.529102 0.073829
H  -3.127973 2.317625 0.242866
H  -2.488693 -1.903287 -0.654554
H  4.550597 1.771937 1.493966
H  3.334849 -1.929607 -0.469214
H  -4.865938 1.526428 1.3447
H  -4.517256 -1.731911 -1.529263
H  6.848282 1.545555 0.484332
H  5.636916 -2.157442 -1.449126
H  -7.316561 1.136689 1.480426
H  -6.962555 -2.141202 -1.352903
H  7.947447 -1.436932 -1.620711
H  7.921312 0.310418 -1.973871
H  8.579341 -0.267236 -0.426051
H  -8.385484 -0.705845 0.143371
