program: Gaussian 09
title: 000026649
version: EM64L-G09RevD.01
frameworkgroup: C1[X(C16H27NO2)]
method: RPBEPBE
basis: SDD
operation: Freq
keyword: #p
keyword: freq=noraman
keyword: PBEPBE/SDD
title: #p freq=noraman PBEPBE/SDD
converged: YES YES NO NO
title: Mulliken charges:
elementType: O O N C C C C C C C C C C C C C C C C H H H H H H H H H H H H H H H H H H H H H H H H H H H
charge: -0.437590 -0.268742 -0.120991 -0.049074 -0.335150 -0.590662 -0.330081 -0.385046 -0.727279 0.515720 -0.382111 -0.678755 -0.329417 -0.405004 -0.409649 -0.360620 -0.362434 0.314713 -0.537986 0.214347 0.200802 0.182296 0.226359 0.200600 0.185899 0.204080 0.186288 0.215700 0.244302 0.208405 0.214869 0.181116 0.213073 0.226531 0.209348 0.206688 0.182343 0.218449 0.232144 0.231480 0.247269 0.236842 0.328265 0.219725 0.244043 0.218898
chargesum: 0.00000
title: Mulliken charges with hydrogens summed into heavy atoms:
elementType: O O N C C C C C C C C C C C C C C C C
charge: -0.109325 -0.268742 -0.120991 0.165272 0.047948 -0.163704 0.059897 0.016943 -0.059704 0.515720 0.012078 -0.036188 0.071375 -0.172860 -0.178169 -0.113351 -0.125592 0.314713 0.144679
polarizability: 2.61628865e+02 -4.83164027e-01 1.67731444e+02 3.42544153e+00 -1.78536549e+01 1.46871853e+02
1716.lowfreq: -13.6585 -4.3093 -2.0190 -0.0011 -0.0006 -0.0005 7.8334 20.3164 33.7767
frequency: 5.5272 20.1739 33.7204 39.1277 50.6032 54.2295 67.6915 98.3269 98.9637 104.3542 137.2154 167.1455 179.8535 180.5927 206.7838 216.6414 228.2167 240.7654 264.0488 280.2131 316.3862 323.4037 338.4617 348.3368 373.9948 412.1420 421.7161 445.1697 446.5855 503.8858 517.9279 537.4673 564.9986 633.5367 712.1680 724.7560 742.3858 763.5007 791.3183 797.9691 807.5885 819.9379 840.8806 847.7233 887.2046 907.7655 934.1079 942.2167 954.6565 960.1579 989.0428 989.8113 1003.1440 1038.5357 1040.5647 1048.9436 1061.4759 1065.3438 1079.3124 1092.5754 1108.9661 1112.2009 1118.3019 1131.0843 1155.8212 1167.0798 1177.5216 1202.0944 1213.9064 1215.9749 1228.5631 1243.0192 1256.9824 1279.0848 1282.6423 1294.2273 1298.8297 1304.0089 1313.6145 1319.4365 1347.1382 1362.7952 1365.3607 1369.2940 1379.0014 1380.5536 1382.8092 1386.9586 1415.4779 1436.4757 1463.4474 1464.8960 1466.0791 1466.5783 1468.6445 1472.7535 1473.1994 1475.8349 1478.2952 1481.0843 1487.6201 1490.7775 1501.2485 1583.3783 1622.9679 2856.0462 2865.8501 2945.9431 2955.0306 2955.7934 2975.3924 2976.5788 2979.7564 2981.0238 3002.3862 3016.1737 3024.3104 3026.8555 3041.7409 3045.2761 3049.9356 3068.1916 3073.0789 3074.9299 3079.5780 3089.6694 3115.1035 3121.9095 3122.4627 3158.0125 3164.1969 3558.1374
redmass: 3.8258 5.0856 3.2929 2.6467 2.1664 2.7861 3.0992 3.1933 3.1566 3.1584 2.0969 3.0249 3.2870 1.9225 2.0776 1.3939 1.5141 1.2916 2.2690 2.2826 1.2616 2.6841 3.1823 3.3263 2.4654 2.9317 3.2441 4.0248 3.2342 3.0030 3.8067 2.4533 3.1112 6.7172 3.7755 3.6625 1.0907 2.8409 1.2558 1.2017 1.8372 1.5077 2.5722 2.1076 1.3770 1.4351 1.4708 2.7358 1.9168 1.3709 2.5155 8.6746 2.6471 2.6774 3.3213 2.0211 2.5814 1.8949 1.8488 2.1381 1.5002 1.2613 1.4220 2.1127 1.3409 1.8164 1.2218 1.9783 2.0538 1.5989 4.3785 1.2872 1.3941 1.1907 1.0757 1.3094 1.2613 1.2857 1.2976 1.3490 1.3483 1.3954 1.3080 1.3566 1.7411 1.9616 1.3491 1.2335 3.2674 1.1715 1.0714 1.0818 1.0494 1.0501 1.0712 1.0615 1.0732 1.0795 1.0739 1.0571 1.0917 1.0729 2.4792 7.0472 6.4654 1.0714 1.0713 1.0696 1.0631 1.0331 1.0378 1.0607 1.0598 1.0371 1.0819 1.0911 1.0869 1.0902 1.1037 1.1015 1.0991 1.0993 1.0982 1.0973 1.0988 1.1004 1.0894 1.0943 1.0940 1.0936 1.0952 1.0661
irintensity: 0.5272 0.1880 0.9410 0.3064 2.8403 1.2575 1.8407 1.3425 1.3049 4.0563 1.0428 2.0965 1.6100 1.6296 1.0683 1.4829 2.0735 0.7608 4.1913 1.9818 134.9015 19.7599 2.4396 8.5647 4.9969 0.0348 9.2667 2.5437 2.7344 7.4218 5.1740 13.6594 35.2904 0.8365 3.6624 4.1991 8.0683 7.8482 4.7041 0.5141 38.1553 4.2832 25.4170 11.3803 2.1108 11.9201 7.1654 58.3451 9.0474 1.0186 16.4896 39.6263 8.8213 17.5912 4.3322 33.9744 42.8825 5.4698 16.2440 13.7980 12.5307 0.1398 34.9377 75.3317 0.7344 16.5328 49.1996 39.9256 35.6678 20.5156 156.0194 7.1610 16.4104 2.5098 2.5101 6.1898 10.5457 4.1660 6.6807 4.2298 1.2501 4.0041 6.0152 1.6622 29.9822 1.5602 38.4317 25.6522 0.5985 10.5245 0.9423 0.4955 4.7217 13.0489 3.4149 5.1500 56.5817 12.7680 1.2575 0.1879 12.7770 14.1277 128.3308 5.1120 38.4636 34.2225 143.9587 59.4880 34.5965 69.0286 16.4673 46.8132 29.4773 21.2797 24.3547 19.5517 18.4217 4.3191 51.3100 20.1190 53.4715 54.0577 45.1246 75.2609 46.8314 43.4494 20.7191 36.4424 6.6878 16.4572 5.6628 6.9219
temp: 298.150 k
press: 1.00000 atm
elementType: 8 8 7 6 6 6 6 6 6 6 6 6 6 6 6 6 6 6 6 1 1 1 1 1 1 1 1 1 1 1 1 1 1 1 1 1 1 1 1 1 1 1 1 1 1 1
symmnumber: 1
zpe: 1050744.0 jmol-1
zpe.correction: 0.400207 hartree
zpe.thermalcorrener: 0.422598 hartree
zpe.thermalcorrenthalpy: 0.423543 hartree
zpe.thermalcorrgfe: 0.344514 hartree
zpe.sumelectzpe: -829.546940 hartree
zpe.sumelectthermal: -829.524548 hartree
zpe.sumelectthermalent: -829.523604 hartree
zpe.sumelectthermalfe: -829.602632 hartree
dipole: -1.2970 3.1869 0.8083
dipole: 3.5344
quadrupole: -114.2974 -122.7645 -117.5031
quadrupole: 5.3196 17.2231 -5.5099
quadrupole: 3.8910 -4.5762 0.6852 5.3196 17.2231 -5.5099
hfenergy: -829.9471469 hartree
pointgroup: C01 [X(C16H27N1O2)]
dipole: 0.5035954 1.2826121 -0.1867256 debye
polarizability: 261.5040249|0.5826946|164.0654012|4.8993656|19.5770801|150.6627355 unknown
InChI: InChI=1S/C16H27NO2/c1-4-17(11-5-6-12-18)14(2)13-15-7-9-16(19-3)10-8-15/h7-10,14,18H,4-6,11-13H2,1-3H3
charge 0 multiplicity 1
46 atoms
O  -7.179302 -2.294487 0.125936
O  5.880905 -0.887648 -0.116136
N  -1.832011 1.14675 -0.075503
C  -0.406243 0.897073 -0.454264
C  -2.816078 0.189491 -0.64011
C  0.139936 -0.360916 0.29264
C  -2.251616 2.565899 -0.213771
C  -3.992614 -0.087696 0.324095
C  -0.151767 0.822187 -1.984997
C  1.653085 -0.500356 0.214317
C  -5.039506 -1.047767 -0.285494
C  -1.690001 3.477389 0.895924
C  -6.19822 -1.34658 0.68261
C  2.273884 -1.411366 -0.682664
C  2.495278 0.29812 1.026615
C  3.674513 -1.518532 -0.771338
C  3.904516 0.20904 0.954688
C  4.49601 -0.704684 0.047423
C  6.770267 -0.070245 0.709966
H  0.165395 1.76027 -0.061263
H  -2.30339 -0.769622 -0.840037
H  -3.223589 0.535334 -1.623544
H  -0.188475 -0.26663 1.34476
H  -0.338988 -1.271366 -0.118052
H  -1.980743 2.985784 -1.215049
H  -3.35584 2.592632 -0.158508
H  -4.481825 0.868029 0.602591
H  -3.582422 -0.511804 1.260929
H  0.929093 0.736383 -2.193602
H  -0.65302 -0.056313 -2.432968
H  -0.525817 1.728506 -2.496494
H  -5.44659 -0.605949 -1.221116
H  -4.560149 -2.005964 -0.567886
H  -1.993125 3.097729 1.887344
H  -0.586177 3.526477 0.87267
H  -2.070568 4.509526 0.777758
H  -6.695452 -0.399629 0.988707
H  -5.824574 -1.848178 1.591502
H  1.647702 -2.048381 -1.319437
H  2.043647 0.999326 1.740101
H  4.153064 -2.222364 -1.459336
H  4.519382 0.839824 1.603958
H  -7.547407 -1.913698 -0.711431
H  6.617307 -0.270033 1.788849
H  7.788335 -0.368878 0.419393
H  6.627791 1.010219 0.510623
