program: Gaussian 09
title: 000262300
version: EM64L-G09RevD.01
frameworkgroup: C1[X(C17H10Br2O2)]
method: RPBEPBE
basis: SDD
operation: Freq
keyword: #p
keyword: freq=noraman
keyword: PBEPBE/SDD
title: #p freq=noraman PBEPBE/SDD
converged: YES YES NO NO
title: Mulliken charges:
elementType: Br Br O O C C C C C C C C C C C C C C C C C H H H H H H H H H H
charge: 0.039860 0.039300 -0.186718 -0.147513 0.385075 0.427727 0.327675 -0.363583 -0.363913 -0.368553 -0.367287 -0.012791 -0.383830 -0.382197 0.281644 -0.236162 -0.236105 -0.319749 -0.234794 -0.263284 -0.147236 0.266726 0.266338 0.239314 0.242094 0.230844 0.231474 0.268449 0.234567 0.261594 0.271031
chargesum: 0.00000
title: Mulliken charges with hydrogens summed into heavy atoms:
elementType: Br Br O O C C C C C C C C C C C C C C C C C
charge: 0.039860 0.039300 -0.186718 -0.147513 0.385075 0.427727 0.327675 -0.096856 -0.097575 -0.368553 -0.367287 -0.012791 -0.144516 -0.140103 0.281644 -0.005318 -0.004630 -0.051300 -0.000227 -0.001691 0.123795
polarizability: 3.40918026e+02 2.08776998e+00 2.15982936e+02 2.95459257e+00 -1.38585795e+01 1.46910608e+02
1716.lowfreq: -0.8510 -0.0004 0.0002 0.0003 3.1132 5.2011 22.2194 24.8466 47.9644
frequency: 22.2058 24.8378 47.9583 58.3318 68.2828 76.8021 90.0411 114.7045 117.1354 174.2211 187.3823 193.9020 217.0724 223.3074 226.5136 273.4402 366.3368 392.6786 404.9022 438.2617 443.8576 504.9090 511.0916 542.9449 586.3292 604.9488 614.0953 624.2911 645.1817 701.4399 710.5460 730.8545 734.6615 764.8542 770.4941 789.1545 838.6190 851.2645 864.8854 868.7025 880.9557 890.0447 899.0348 908.4042 925.8289 976.1329 989.4403 997.8602 1013.3435 1022.3000 1042.2917 1053.1945 1060.2056 1088.6167 1139.2211 1175.9979 1179.4308 1196.8623 1199.4018 1212.1084 1277.3059 1288.5288 1310.6315 1337.1609 1363.5314 1369.3419 1388.9712 1434.4011 1435.3890 1450.3855 1493.9751 1519.5705 1534.2737 1581.3091 1587.1283 1591.5749 1612.8585 3126.9958 3130.4723 3142.6831 3152.3261 3167.9468 3168.1961 3171.6185 3224.0253 3238.0543 3266.1428
redmass: 8.4402 8.0863 3.9405 5.0931 8.2577 8.7755 6.4394 12.6050 18.6461 5.8092 4.6391 6.9797 12.2175 10.2549 6.7617 6.8043 8.4941 7.4239 2.8629 6.0614 5.8337 5.1642 4.6971 6.1847 2.9350 5.7017 5.8814 5.1990 4.4127 1.8595 7.2893 5.7441 5.3180 1.2877 1.8218 8.1289 1.3661 1.2636 5.8874 6.5504 1.5624 1.3800 1.3960 4.7089 1.4545 1.4549 5.0218 1.3209 3.3253 2.0592 2.7236 2.4059 2.4056 1.6120 1.7048 1.0541 2.6534 1.8809 1.2059 1.5204 2.5511 7.4768 1.6871 2.2056 5.2545 2.6552 5.3113 3.1528 2.3612 5.1374 2.6769 7.9241 6.4802 9.6597 6.0597 8.0141 6.0159 1.0848 1.0875 1.0919 1.0965 1.0924 1.1003 1.0931 1.0922 1.0986 1.1088
irintensity: 1.9825 0.8643 0.0259 0.8232 0.2084 0.1643 0.3607 0.4211 0.1891 0.5053 0.1605 1.4657 0.1186 1.0672 1.1604 2.8728 6.3718 3.7541 0.0495 13.2128 10.9889 0.2117 2.5595 7.5198 7.9106 0.2714 0.6338 2.2817 3.2540 31.9907 100.1291 17.9299 17.2192 71.3132 61.2027 3.3559 9.3212 0.1326 39.3918 18.0673 22.6985 1.6410 0.1027 48.6247 0.5017 1.2026 0.9057 0.0154 16.2350 20.4215 31.9849 6.5430 49.2873 7.0527 7.0558 0.1135 11.3030 25.9868 1.5141 1.7321 23.4227 103.0471 18.2942 23.1174 7.9446 10.1084 19.3643 23.0288 3.4462 97.8192 21.4394 122.5390 25.1635 199.0525 0.3510 180.7437 3.0704 6.5490 0.1648 14.8479 31.9064 2.2534 19.7834 5.7285 3.2780 0.0820 0.0546
temp: 298.150 k
press: 1.00000 atm
elementType: 35 35 8 8 6 6 6 6 6 6 6 6 6 6 6 6 6 6 6 6 6 1 1 1 1 1 1 1 1 1 1
symmnumber: 1
zpe: 566054.5 jmol-1
zpe.correction: 0.215599 hartree
zpe.thermalcorrener: 0.234027 hartree
zpe.thermalcorrenthalpy: 0.234971 hartree
zpe.thermalcorrgfe: 0.165037 hartree
zpe.sumelectzpe: -829.709468 hartree
zpe.sumelectthermal: -829.691040 hartree
zpe.sumelectthermalent: -829.690096 hartree
zpe.sumelectthermalfe: -829.760029 hartree
dipole: 2.7732 -0.2040 5.1895
dipole: 5.8875
quadrupole: -111.7290 -136.2293 -141.5013
quadrupole: 1.2264 -15.4381 -3.8771
quadrupole: 18.0909 -6.4094 -11.6815 1.2264 -15.4381 -3.8771
hfenergy: -829.9250669 hartree
pointgroup: C01 [X(C17H10Br2O2)]
dipole: -1.0260836 0.1897571 -2.0679832 debye
polarizability: 340.5269304|-3.9133796|211.3331986|8.6775241|22.0904233|151.9514409 unknown
InChI: InChI=1S/C17H10Br2O2/c18-13-9-12(11-5-2-1-3-6-11)10-14(19)16(13)17(20)15-7-4-8-21-15/h1-10H
charge 0 multiplicity 1
31 atoms
Br 1.284967 -3.054709 0.476991
Br 1.295698 2.775087 0.963409
O  4.89007 -0.085265 0.14697
O  2.959806 -0.275713 2.243618
C  -1.73079 -0.087005 0.153662
C  1.102677 -0.136796 0.684145
C  -3.196838 -0.060961 -0.117597
C  -1.016356 -1.314775 0.181395
C  -1.012364 1.115858 0.38973
C  0.365387 -1.320947 0.440279
C  0.368246 1.073354 0.650739
C  2.586597 -0.169779 1.04247
C  -3.794736 -1.018571 -0.982413
C  -4.031251 0.9219 0.482526
C  3.496765 -0.067956 -0.098881
C  -5.181614 -0.994044 -1.239426
C  -5.418152 0.946826 0.225452
C  3.278213 0.050949 -1.475567
C  -6.000415 -0.010928 -0.63699
C  4.565904 0.112228 -2.110609
C  5.512383 0.02647 -1.094482
H  -1.544144 -2.260977 0.037337
H  -1.5253 2.079821 0.341296
H  -3.168473 -1.766988 -1.48133
H  -3.600044 1.648743 1.180279
H  -5.621687 -1.735126 -1.915628
H  -6.045377 1.7059 0.705472
H  2.304363 0.09019 -1.959863
H  -7.077413 0.00811 -0.83606
H  4.77122 0.206932 -3.174629
H  6.599161 0.029074 -1.077697
