program: Gaussian 09
title: 000262280
version: EM64L-G09RevD.01
frameworkgroup: C1[X(C14H11BrO2)]
method: RPBEPBE
basis: SDD
operation: Freq
keyword: #p
keyword: freq=noraman
keyword: PBEPBE/SDD
title: #p freq=noraman PBEPBE/SDD
converged: YES YES NO NO
title: Mulliken charges:
elementType: Br O O C C C C C C C C C C C C C C H H H H H H H H H H H
charge: 0.028488 -0.264972 -0.206974 0.358503 0.339495 -0.383723 -0.369920 0.364870 -0.391759 -0.393816 -0.331231 -0.407839 -0.234516 -0.233481 -0.239909 0.322779 -0.775669 0.243821 0.245532 0.300322 0.257629 0.238956 0.237628 0.227447 0.227222 0.231368 0.305951 0.303803
chargesum: 0.00000
title: Mulliken charges with hydrogens summed into heavy atoms:
elementType: Br O O C C C C C C C C C C C C C C
charge: 0.028488 -0.264972 -0.206974 0.358503 0.339495 -0.139903 -0.124388 0.364870 -0.152803 -0.156188 -0.030910 -0.150211 -0.007069 -0.006259 -0.008541 0.322779 -0.165916
polarizability: 3.15734040e+02 5.72615131e+00 1.57158953e+02 8.38640898e+00 -5.92252113e+00 9.29124405e+01
1716.lowfreq: -6.1995 -3.0561 -0.0007 -0.0006 -0.0005 5.9946 16.8547 23.7264 42.4805
frequency: 16.2683 23.7151 42.4722 68.6185 82.7535 87.3887 139.9740 161.7172 220.4672 241.0831 306.3259 350.7349 375.2141 405.6287 414.7000 424.6500 484.7201 503.4064 540.5554 552.3967 612.4876 626.5604 652.7442 700.5865 701.6366 719.3278 725.0740 766.7915 771.0774 837.2155 849.3522 852.7987 895.0885 903.1382 919.8973 962.8684 973.8541 978.1362 988.8812 994.1141 994.5529 1015.2297 1040.6046 1081.7647 1085.4564 1120.9969 1152.3066 1174.2900 1192.0916 1205.4703 1208.3323 1227.8709 1290.1898 1303.2326 1313.8576 1360.0847 1375.5720 1415.1713 1425.7128 1439.7745 1471.8663 1506.1379 1572.3261 1589.1851 1612.4021 1614.8631 1632.8126 3084.9788 3124.1721 3128.0744 3140.2160 3143.4593 3146.2702 3150.4693 3166.2435 3172.1619 3182.7823 3209.6268
redmass: 5.3986 10.5329 8.6185 3.8255 5.4875 7.0768 7.4638 4.9916 5.6231 6.1952 5.5755 4.9224 4.1801 2.8475 2.9975 4.6068 5.7505 3.9138 5.6726 2.6144 6.6351 6.8247 6.0250 6.1404 1.7300 8.0101 3.3641 5.0685 2.0045 1.2872 1.2523 1.5506 1.8977 4.9060 1.4491 1.3583 1.4334 1.4036 4.5259 5.7085 1.3481 2.7892 1.8923 1.5679 1.6190 1.3313 2.4647 1.0525 1.1577 2.1948 1.3527 1.1965 3.0534 1.3308 1.4267 3.0229 9.2899 4.0019 1.1137 2.4140 2.1296 2.7919 6.2536 6.6552 6.0676 6.3862 10.8463 1.0559 1.0846 1.0875 1.0917 1.0902 1.0895 1.0960 1.1016 1.0964 1.1123 1.0944
irintensity: 0.2477 0.4796 0.5635 0.0452 1.0708 1.3428 0.6707 3.0474 2.5634 1.1093 3.9094 1.1563 3.6955 0.6197 0.0459 0.9956 23.9930 4.4454 14.8417 4.3784 0.4666 3.2585 34.9688 3.2119 48.3243 3.5918 8.6431 4.7156 75.8525 6.0394 1.1305 58.0988 19.8405 49.0919 2.1591 2.1152 0.2555 2.2058 0.2823 21.5282 0.7164 0.7126 2.6116 202.2681 8.7115 11.2911 164.8522 0.0337 2.5669 320.2787 10.9896 10.1050 1.0006 2.7253 2.4367 4.2547 1.4616 8.5399 23.1137 4.0702 104.3029 24.2433 3.0090 1.4819 1.8314 2.7290 274.0902 6.0266 7.2208 0.3838 22.0342 4.0523 2.5296 41.8667 28.8413 3.9339 0.6210 2.5811
temp: 298.150 k
press: 1.00000 atm
elementType: 35 8 8 6 6 6 6 6 6 6 6 6 6 6 6 6 6 1 1 1 1 1 1 1 1 1 1 1
symmnumber: 1
zpe: 549953.4 jmol-1
zpe.correction: 0.209466 hartree
zpe.thermalcorrener: 0.224395 hartree
zpe.thermalcorrenthalpy: 0.225339 hartree
zpe.thermalcorrgfe: 0.163286 hartree
zpe.sumelectzpe: -702.809781 hartree
zpe.sumelectthermal: -702.794852 hartree
zpe.sumelectthermalent: -702.793908 hartree
zpe.sumelectthermalfe: -702.855960 hartree
dipole: -1.8673 -0.6096 1.7826
dipole: 2.6526
quadrupole: -95.9346 -103.3812 -109.4350
quadrupole: 0.8910 9.1758 -0.1984
quadrupole: 6.9823 -0.4643 -6.5181 0.8910 9.1758 -0.1984
hfenergy: -703.0192468 hartree
pointgroup: C01 [X(C14H11Br1O2)]
dipole: -0.6829097 0.0400911 0.7881116 debye
polarizability: 313.3880268|-19.964975|153.1463474|-11.6570352|-18.7944167|99.271059 unknown
InChI: InChI=1S/C14H11BrO2/c15-10-14(16)17-13-8-6-12(7-9-13)11-4-2-1-3-5-11/h1-9H,10H2
charge 0 multiplicity 1
28 atoms
Br 5.880298 -2.040562 -0.962002
O  3.094003 -0.503498 0.381973
O  3.953251 1.115986 -1.10628
C  -1.136903 -0.069721 0.083206
C  -2.621908 0.043568 0.016744
C  -0.29923 0.753817 -0.716223
C  -0.509602 -1.008291 0.950479
C  1.690872 -0.279241 0.206606
C  -3.249292 1.296068 -0.231847
C  -3.451753 -1.097535 0.200008
C  1.108231 0.666599 -0.668271
C  0.890556 -1.116466 1.014491
C  -4.654566 1.404099 -0.296285
C  -4.857294 -0.990528 0.137484
C  -5.466818 0.261132 -0.111369
C  4.11057 0.180567 -0.293673
C  5.450453 -0.38519 0.128681
H  -0.752265 1.462309 -1.418076
H  -1.122397 -1.638993 1.602816
H  1.729962 1.305158 -1.295956
H  1.377081 -1.832428 1.683344
H  -2.634369 2.196323 -0.343884
H  -2.99358 -2.080373 0.359495
H  -5.116204 2.380617 -0.480576
H  -5.476397 -1.884508 0.272278
H  -6.558057 0.34455 -0.160679
H  5.45149 -0.715476 1.175849
H  6.252773 0.329217 -0.094433
