program: Gaussian 09
title: 000262309
version: EM64L-G09RevD.01
frameworkgroup: C1[X(C18H13NO5S)]
method: RPBEPBE
basis: SDD
operation: Freq
keyword: #p
keyword: freq=noraman
keyword: PBEPBE/SDD
title: #p freq=noraman PBEPBE/SDD
converged: YES YES NO NO
title: Mulliken charges:
elementType: S O O O O O N C C C C C C C C C C C C C C C C C C H H H H H H H H H H H H H
charge: 0.955410 -0.344258 -0.481997 -0.519893 -0.198255 -0.177215 0.023006 -0.225753 0.366489 0.274315 0.340744 0.437069 -0.358572 -0.350396 -0.318725 -0.350058 -0.205420 -0.323870 -0.374504 -0.374819 -0.219807 -0.193734 -0.233857 -0.233274 -0.233111 0.241618 0.240335 0.290803 0.260998 0.314009 0.294141 0.239178 0.238605 0.252904 0.249489 0.231624 0.231620 0.235163
chargesum: 0.00000
title: Mulliken charges with hydrogens summed into heavy atoms:
elementType: S O O O O O N C C C C C C C C C C C C C C C C C C
charge: 0.955410 -0.344258 -0.481997 -0.519893 -0.198255 -0.177215 0.023006 -0.225753 0.366489 0.274315 0.340744 0.437069 -0.116954 -0.110061 -0.027922 -0.089060 0.108588 -0.029728 -0.135326 -0.136215 0.033097 0.055755 -0.002233 -0.001654 0.002052
polarizability: 6.95640202e+02 3.22908947e+01 2.51652891e+02 1.25097524e+00 6.64527521e-01 1.29842907e+02
1716.lowfreq: -4.2176 -0.0010 0.0011 0.0017 0.9852 6.8441 15.5804 17.2514 22.6512
frequency: 15.5209 17.0387 22.5348 31.6075 44.3756 68.8697 79.5109 97.0881 106.7708 120.0051 137.8068 154.2492 174.3649 181.3190 226.1501 236.2748 255.6612 290.4136 304.8188 333.9198 372.9183 378.2534 396.4261 403.3990 411.6339 422.1411 438.1962 448.2529 497.5861 505.7260 525.5968 551.8624 577.2633 610.5311 621.5585 628.6725 655.2824 668.9383 695.4538 705.3725 718.3927 736.9107 778.7035 787.1493 790.6759 808.3236 823.5570 829.5723 847.2936 866.2774 903.7725 909.7431 924.0841 974.7199 975.9749 981.6564 984.9468 987.9061 988.5779 989.3660 997.4525 1004.8923 1010.0801 1032.6364 1037.2142 1088.6955 1092.3620 1114.7681 1137.7184 1163.5039 1173.6685 1176.0773 1196.5962 1210.6032 1240.2141 1251.1431 1294.2394 1296.6529 1310.7860 1345.3012 1377.8224 1378.9957 1395.9370 1424.9123 1434.8618 1439.5956 1439.9972 1461.1240 1499.0957 1519.6970 1576.6970 1579.8150 1587.8815 1595.0980 1609.3436 3128.9210 3133.6314 3141.9917 3142.9080 3144.5697 3148.4313 3154.6432 3155.4141 3169.2385 3170.1740 3170.3326 3180.1060 3184.3074
redmass: 6.4639 6.0756 8.4323 6.3146 7.1518 5.4422 4.9953 8.5075 5.6645 6.1475 7.0767 10.1780 8.3996 8.9136 7.6815 7.5944 7.7578 7.2000 9.1288 6.0343 10.0495 9.1462 4.5045 3.1098 3.3474 5.1583 5.7875 5.3382 4.0732 4.3803 6.9114 3.7582 3.6615 6.6072 6.9703 6.9135 5.2410 8.6277 1.7174 5.7271 3.7259 2.8664 2.2008 9.3272 1.3742 14.8857 3.3223 1.4725 1.2912 1.7479 1.4996 7.2614 1.4497 1.4853 1.3946 1.6639 6.7268 2.9173 1.3798 4.3632 1.3291 3.1342 1.3548 2.6151 1.9280 1.6343 2.3684 1.3873 1.7843 1.4967 1.0697 1.0553 1.1588 11.0470 2.2742 1.4619 2.5958 1.4867 1.6241 2.3448 7.2225 7.5631 9.4001 2.3354 3.0560 2.3925 3.2580 2.0664 2.6323 5.5988 6.3970 5.8124 7.0336 5.7377 6.0453 1.0848 1.0877 1.0888 1.0893 1.0899 1.0901 1.0901 1.0961 1.0999 1.0960 1.0968 1.0962 1.0986
irintensity: 0.2848 2.9650 2.8275 0.3163 0.4448 15.2347 3.4363 0.3393 6.3737 0.6435 24.4894 0.5324 33.3121 15.2187 2.7869 39.7708 38.6898 42.2444 1.8498 5.1818 26.1453 29.3837 23.6194 1.7411 2.0188 27.6320 13.8008 55.8426 67.6222 7.0579 1.3182 4.7632 5.8789 0.2142 6.1474 0.4615 11.8883 15.2661 47.2594 22.3236 13.9342 30.0061 48.3171 8.8730 60.0346 88.5078 9.3081 0.5897 1.7885 53.5814 7.9892 59.2444 0.8519 0.7079 1.5516 0.9804 6.4448 0.2798 4.7329 8.1279 0.0077 3.0854 0.0349 1.5086 2.4814 8.4349 69.7532 6.8972 23.1924 156.7268 4.5622 0.0063 43.2799 165.5689 45.5817 17.5259 52.6920 4.4947 1.2690 0.7624 0.8227 176.9099 10.2446 37.6390 17.8435 42.2037 5.7627 8.5815 1.6695 1.1726 48.7543 1.6550 10.6796 371.8383 1.4935 6.3166 0.9968 20.5472 16.0430 6.9442 0.5062 1.9229 34.0509 28.0884 52.6662 2.7629 7.6997 12.7561
temp: 298.150 k
press: 1.00000 atm
elementType: 16 8 8 8 8 8 7 6 6 6 6 6 6 6 6 6 6 6 6 6 6 6 6 6 6 1 1 1 1 1 1 1 1 1 1 1 1 1
symmnumber: 1
zpe: 703052.0 jmol-1
zpe.correction: 0.267778 hartree
zpe.thermalcorrener: 0.290090 hartree
zpe.thermalcorrenthalpy: 0.291034 hartree
zpe.thermalcorrgfe: 0.212274 hartree
zpe.sumelectzpe: -1520.637446 hartree
zpe.sumelectthermal: -1520.615135 hartree
zpe.sumelectthermalent: -1520.614191 hartree
zpe.sumelectthermalfe: -1520.692950 hartree
dipole: 0.0259 -0.2746 -3.2320
dipole: 3.2438
quadrupole: -79.4496 -152.8291 -162.5662
quadrupole: 4.3868 11.4253 1.6434
quadrupole: 52.1653 -21.2141 -30.9512 4.3868 11.4253 1.6434
hfenergy: -1520.9052248 hartree
pointgroup: C01 [X(C18H13N1O5S1)]
dipole: 0.0225301 0.363822 1.2230349 debye
polarizability: 693.0450629|-47.2115229|237.7816407|2.7885021|-41.6033664|146.3092957 unknown
InChI: InChI=1S/C12H9O.C6H4NO4S/c13-12-8-6-11(7-9-12)10-4-2-1-3-5-10;8-7(9)5-3-1-2-4-6(5)12(10)11/h1-9H;1-4H
charge 0 multiplicity 1
38 atoms
S  2.082061 -1.571266 -0.31529
O  0.924291 -0.405537 1.043694
O  1.639313 -1.477479 -1.880665
O  2.225729 -3.068105 0.322595
O  3.895893 2.57738 -1.536118
O  2.109502 1.220086 -1.136183
N  3.363783 1.497459 -1.072143
C  3.827707 -0.773641 -0.008111
C  -3.218128 -0.038385 0.34206
C  -0.403336 -0.32019 0.76232
C  -4.679442 0.115091 0.131861
C  4.25586 0.512205 -0.40489
C  -2.285833 0.826512 -0.312502
C  -2.702225 -1.061396 1.199872
C  -0.905367 0.689295 -0.123499
C  -1.325645 -1.215498 1.39782
C  4.708776 -1.64336 0.656322
C  5.58482 0.923189 -0.14908
C  -5.246157 1.385647 -0.178688
C  -5.557724 -1.003024 0.234354
C  6.034638 -1.228885 0.919197
C  6.471338 0.052127 0.513831
C  -6.634063 1.532627 -0.375201
C  -6.944948 -0.856916 0.033206
C  -7.491728 0.41215 -0.271202
H  -2.654481 1.585121 -1.010684
H  -3.396683 -1.717076 1.735369
H  -0.187463 1.328475 -0.645441
H  -0.924686 -1.990275 2.059302
H  4.346061 -2.634123 0.951853
H  5.887486 1.922254 -0.474515
H  -4.601311 2.269562 -0.232154
H  -5.14804 -1.998839 0.435497
H  6.718584 -1.909271 1.436249
H  7.497606 0.37425 0.715393
H  -7.04861 2.5210 -0.601566
H  -7.598998 -1.732774 0.104521
H  -8.570179 0.526011 -0.42588
