program: Gaussian 09
title: 000262273
version: EM64L-G09RevD.01
frameworkgroup: C1[X(C14H8Br4O2)]
method: RPBEPBE
basis: SDD
operation: Freq
keyword: #p
keyword: freq=noraman
keyword: PBEPBE/SDD
title: #p freq=noraman PBEPBE/SDD
converged: YES YES NO NO
title: Mulliken charges:
elementType: Br Br Br Br O O C C C C C C C C C C C C C C H H H H H H H H
charge: 0.071512 0.046974 0.023970 0.051026 -0.267511 -0.161038 0.395996 0.337566 -0.367459 -0.361037 0.624117 -0.385313 -0.377576 -0.372865 -0.370464 -0.190161 -0.190535 -0.220181 0.325500 -0.770187 0.265720 0.264104 0.246830 0.248834 0.254052 0.254478 0.314263 0.309387
chargesum: 0.00000
title: Mulliken charges with hydrogens summed into heavy atoms:
elementType: Br Br Br Br O O C C C C C C C C C C C C C C
charge: 0.071512 0.046974 0.023970 0.051026 -0.267511 -0.161038 0.395996 0.337566 -0.101739 -0.096933 0.624117 -0.385313 -0.377576 -0.126036 -0.121630 0.063890 0.063943 -0.220181 0.325500 -0.146537
polarizability: 3.87094535e+02 2.03083256e+00 2.28171411e+02 5.65824004e+00 -9.76801827e+00 1.03902276e+02
1716.lowfreq: -0.7206 -0.0002 0.0004 0.0005 3.2919 4.3449 9.4776 23.4695 26.5020
frequency: 9.4495 23.4430 26.4849 34.3220 43.7223 46.8026 59.2244 93.2789 107.2957 119.6515 138.6846 172.1813 186.1463 190.8588 236.1480 254.5318 274.4690 287.0268 328.0508 371.0237 405.8446 412.4897 432.5563 480.7192 504.2295 507.0989 560.9541 581.0551 600.2225 626.1686 658.5005 693.9638 712.0577 713.5069 724.4084 760.7295 799.0662 830.7097 831.1244 873.8566 885.0736 888.6718 899.5478 956.4784 968.2172 993.0363 1023.3812 1047.7516 1061.0146 1068.9233 1118.4568 1188.8395 1196.3430 1209.9193 1218.8649 1233.6743 1288.0924 1299.7098 1325.6093 1358.7584 1387.8952 1397.9175 1427.7050 1436.2121 1485.1905 1537.6646 1573.2088 1589.0527 1597.6940 1677.5115 3086.1070 3141.5438 3143.4944 3168.3114 3171.2378 3172.5806 3174.8950 3181.8949
redmass: 25.4862 24.1997 9.2216 14.4224 13.7853 3.9551 13.7872 15.9105 26.4673 11.1716 8.2064 14.7407 10.3586 4.8425 8.5449 9.5371 10.5850 5.9291 5.3166 6.5859 3.2959 4.1067 5.6870 5.9457 5.0319 4.5580 5.4501 6.4263 5.4827 7.2642 4.6099 4.9750 6.5810 5.8659 4.6900 7.5951 6.5240 1.4410 1.2894 5.7917 1.6330 1.4123 1.8000 1.3470 1.3880 5.1156 7.5080 3.3072 2.0553 2.1240 1.3969 1.7122 1.1735 1.6944 2.0098 1.2335 3.6105 1.2651 3.0866 10.6207 4.7670 3.2128 1.1165 2.9407 2.9330 7.9779 7.7015 7.2248 6.0455 11.7336 1.0555 1.0891 1.0891 1.0918 1.0952 1.0929 1.0963 1.1126
irintensity: 0.2705 0.1123 0.4023 0.6595 0.6468 0.0228 0.3535 0.9374 0.3156 0.6758 2.1684 1.0079 0.6704 0.0533 4.1008 1.0914 1.0262 1.1562 9.6069 2.4065 0.6767 0.0891 2.7338 4.5608 2.5536 34.3381 3.8431 27.8460 2.5688 0.3950 7.4107 0.3518 11.3810 31.1772 42.7558 36.7521 74.1912 66.9563 13.7931 60.1131 14.8491 4.9081 7.6250 0.0627 2.7398 75.8653 19.2578 12.9511 318.0399 6.8764 5.2058 316.3316 23.0282 7.6815 4.6753 21.9842 33.8180 0.9530 17.4076 0.0492 25.6955 2.5784 34.3513 189.1576 33.6469 71.5459 5.7661 48.9351 30.4411 163.0339 3.4459 4.4330 10.5522 0.3634 6.5201 1.5914 1.0459 0.0952
temp: 298.150 k
press: 1.00000 atm
elementType: 35 35 35 35 8 8 6 6 6 6 6 6 6 6 6 6 6 6 6 6 1 1 1 1 1 1 1 1
symmnumber: 1
zpe: 468293.4 jmol-1
zpe.correction: 0.178364 hartree
zpe.thermalcorrener: 0.198222 hartree
zpe.thermalcorrenthalpy: 0.199167 hartree
zpe.thermalcorrgfe: 0.122172 hartree
zpe.sumelectzpe: -741.166162 hartree
zpe.sumelectthermal: -741.146304 hartree
zpe.sumelectthermalent: -741.145359 hartree
zpe.sumelectthermalfe: -741.222354 hartree
dipole: 0.7395 1.2617 -1.0265
dipole: 1.7867
quadrupole: -155.8690 -142.4975 -160.0211
quadrupole: -6.2988 1.1334 -3.9837
quadrupole: -3.0731 10.2983 -7.2253 -6.2988 1.1334 -3.9837
hfenergy: -741.344526 hartree
pointgroup: C01 [X(C14H8Br4O2)]
dipole: 0.2781829 0.5241854 -0.3767857 debye
polarizability: 384.7546405|12.3427979|229.4855102|21.0622476|-5.5499672|104.9280715 unknown
InChI: InChI=1S/C14H8Br4O2/c15-7-13(19)20-14-11(17)5-9(6-12(14)18)8-1-3-10(16)4-2-8/h1-6H,7H2
charge 0 multiplicity 1
28 atoms
Br -2.195374 -2.78871 -0.702222
Br -2.068864 3.010022 -0.284357
Br 7.19745 -0.160464 0.437422
Br -6.34467 -1.594717 -0.41474
O  -3.293526 0.156762 -0.676866
O  -3.748079 0.01009 1.627318
C  0.946723 0.020958 -0.190279
C  2.428838 -0.022322 -0.044051
C  0.253208 1.260925 -0.178453
C  0.197635 -1.17612 -0.344034
C  -1.894496 0.101712 -0.46154
C  -1.201546 -1.131056 -0.475838
C  -1.145025 1.292149 -0.314891
C  3.245922 1.019005 -0.561715
C  3.065251 -1.105955 0.619941
C  4.649492 0.986278 -0.425061
C  4.467365 -1.154612 0.765811
C  5.247597 -0.10412 0.239905
C  -4.153574 0.11131 0.460353
C  -5.588345 0.233556 -0.000088
H  0.798234 2.1963 -0.027368
H  0.707669 -2.141731 -0.394283
H  2.791405 1.852513 -1.108147
H  2.463508 -1.908071 1.060887
H  5.26397 1.790873 -0.838441
H  4.93979 -1.990527 1.289075
H  -5.670166 0.812121 -0.929244
H  -6.21239 0.635036 0.808508
